Ionic New Project Error


#1

Hey everyone,
It’s been a while.

I was re-installing npm install -g ionic cordova earlier today and now when I go to start my new project ionic start "Proj" tabs and my project runs into the following error (after I click y to accept the native help with Cordova).

Error Output Portion:

> npm i
× Running command - failed!
[ERROR] An error occurred while running npm i (exit code 1):



        > node-sass@4.7.2 install C:\Downloads\Wamp3\www\app\Proj\node_modules\node-sass
        > node scripts/install.js

        Downloading binary from https://github.com/sass/node-sass/releases/download/v4.7.2/win32-x64-64_binding.node
        Cannot download "https://github.com/sass/node-sass/releases/download/v4.7.2/win32-x64-64_binding.node":

        HTTP error 404 Not Found

        Hint: If github.com is not accessible in your location
               try setting a proxy via HTTP_PROXY, e.g.

               export HTTP_PROXY=http://example.com:1234

        or configure npm proxy via

               npm config set proxy http://example.com:8080

        > uglifyjs-webpack-plugin@0.4.6 postinstall
        C:\Downloads\Wamp3\www\app\Proj\node_modules\uglifyjs-webpack-plugin
        > node lib/post_install.js


        > node-sass@4.7.2 postinstall C:\Downloads\Wamp3\www\app\Proj\node_modules\node-sass
        > node scripts/build.js

        Building: C:\Downloads\NodeJS\node.exe C:\Downloads\Wamp3\www\app\Proj\node_modules\node-gyp\bin\node-gyp.js
        rebuild --verbose --libsass_ext= --libsass_cflags= --libsass_ldflags= --libsass_library=
        gyp info it worked if it ends with ok
        gyp verb cli [ 'C:\\Downloads\\NodeJS\\node.exe',
        gyp verb cli   'C:\\Downloads\\Wamp3\\www\\app\\Proj\\node_modules\\node-gyp\\bin\\node-gyp.js',
        gyp verb cli   'rebuild',
        gyp verb cli   '--verbose',
        gyp verb cli   '--libsass_ext=',
        gyp verb cli   '--libsass_cflags=',
        gyp verb cli   '--libsass_ldflags=',
        gyp verb cli   '--libsass_library=' ]
        gyp info using node-gyp@3.7.0
        gyp info using node@10.4.0 | win32 | x64
        gyp verb command rebuild []
        gyp verb command clean []
        gyp verb clean removing "build" directory
        gyp verb command configure []
        gyp verb check python checking for Python executable "python2" in the PATH
        gyp verb `which` failed Error: not found: python2
        gyp verb `which` failed     at getNotFoundError
        (C:\Downloads\Wamp3\www\app\Proj\node_modules\which\which.js:13:12)
        gyp verb `which` failed     at F (C:\Downloads\Wamp3\www\app\Proj\node_modules\which\which.js:68:19)
        gyp verb `which` failed     at E (C:\Downloads\Wamp3\www\app\Proj\node_modules\which\which.js:80:29)
        gyp verb `which` failed     at C:\Downloads\Wamp3\www\app\Proj\node_modules\which\which.js:89:16
        gyp verb `which` failed     at C:\Downloads\Wamp3\www\app\Proj\node_modules\isexe\index.js:42:5
        gyp verb `which` failed     at C:\Downloads\Wamp3\www\app\Proj\node_modules\isexe\windows.js:36:5
        gyp verb `which` failed     at FSReqWrap.oncomplete (fs.js:184:21)
        gyp verb `which` failed  python2 { Error: not found: python2
        gyp verb `which` failed     at getNotFoundError
        (C:\Downloads\Wamp3\www\app\Proj\node_modules\which\which.js:13:12)
        gyp verb `which` failed     at F (C:\Downloads\Wamp3\www\app\Proj\node_modules\which\which.js:68:19)
        gyp verb `which` failed     at E (C:\Downloads\Wamp3\www\app\Proj\node_modules\which\which.js:80:29)
        gyp verb `which` failed     at C:\Downloads\Wamp3\www\app\Proj\node_modules\which\which.js:89:16
        gyp verb `which` failed     at C:\Downloads\Wamp3\www\app\Proj\node_modules\isexe\index.js:42:5
        gyp verb `which` failed     at C:\Downloads\Wamp3\www\app\Proj\node_modules\isexe\windows.js:36:5
        gyp verb `which` failed     at FSReqWrap.oncomplete (fs.js:184:21)
        gyp verb `which` failed   stack:
        gyp verb `which` failed    'Error: not found: python2\n    at getNotFoundError
        (C:\\Downloads\\Wamp3\\www\\app\\Proj\\node_modules\\which\\which.js:13:12)\n    at F
        (C:\\Downloads\\Wamp3\\www\\app\\Proj\\node_modules\\which\\which.js:68:19)\n    at E
        (C:\\Downloads\\Wamp3\\www\\app\\Proj\\node_modules\\which\\which.js:80:29)\n    at
        C:\\Downloads\\Wamp3\\www\\app\\Proj\\node_modules\\which\\which.js:89:16\n    at
        C:\\Downloads\\Wamp3\\www\\app\\Proj\\node_modules\\isexe\\index.js:42:5\n    at
        C:\\Downloads\\Wamp3\\www\\app\\Proj\\node_modules\\isexe\\windows.js:36:5\n    at FSReqWrap.oncomplete
        (fs.js:184:21)',
        gyp verb `which` failed   code: 'ENOENT' }
        gyp verb check python checking for Python executable "python" in the PATH
        gyp verb `which` failed Error: not found: python
        gyp verb `which` failed     at getNotFoundError
        (C:\Downloads\Wamp3\www\app\Proj\node_modules\which\which.js:13:12)
        gyp verb `which` failed     at F (C:\Downloads\Wamp3\www\app\Proj\node_modules\which\which.js:68:19)
        gyp verb `which` failed     at E (C:\Downloads\Wamp3\www\app\Proj\node_modules\which\which.js:80:29)
        gyp verb `which` failed     at C:\Downloads\Wamp3\www\app\Proj\node_modules\which\which.js:89:16
        gyp verb `which` failed     at C:\Downloads\Wamp3\www\app\Proj\node_modules\isexe\index.js:42:5
        gyp verb `which` failed     at C:\Downloads\Wamp3\www\app\Proj\node_modules\isexe\windows.js:36:5
        gyp verb `which` failed     at FSReqWrap.oncomplete (fs.js:184:21)
        gyp verb `which` failed  python { Error: not found: python
        gyp verb `which` failed     at getNotFoundError
        (C:\Downloads\Wamp3\www\app\Proj\node_modules\which\which.js:13:12)
        gyp verb `which` failed     at F (C:\Downloads\Wamp3\www\app\Proj\node_modules\which\which.js:68:19)
        gyp verb `which` failed     at E (C:\Downloads\Wamp3\www\app\Proj\node_modules\which\which.js:80:29)
        gyp verb `which` failed     at C:\Downloads\Wamp3\www\app\Proj\node_modules\which\which.js:89:16
        gyp verb `which` failed     at C:\Downloads\Wamp3\www\app\Proj\node_modules\isexe\index.js:42:5
        gyp verb `which` failed     at C:\Downloads\Wamp3\www\app\Proj\node_modules\isexe\windows.js:36:5
        gyp verb `which` failed     at FSReqWrap.oncomplete (fs.js:184:21)
        gyp verb `which` failed   stack:
        gyp verb `which` failed    'Error: not found: python\n    at getNotFoundError
        (C:\\Downloads\\Wamp3\\www\\app\\Proj\\node_modules\\which\\which.js:13:12)\n    at F
        (C:\\Downloads\\Wamp3\\www\\app\\Proj\\node_modules\\which\\which.js:68:19)\n    at E
        (C:\\Downloads\\Wamp3\\www\\app\\Proj\\node_modules\\which\\which.js:80:29)\n    at
        C:\\Downloads\\Wamp3\\www\\app\\Proj\\node_modules\\which\\which.js:89:16\n    at
        C:\\Downloads\\Wamp3\\www\\app\\Proj\\node_modules\\isexe\\index.js:42:5\n    at
        C:\\Downloads\\Wamp3\\www\\app\\Proj\\node_modules\\isexe\\windows.js:36:5\n    at FSReqWrap.oncomplete
        (fs.js:184:21)',
        gyp verb `which` failed   code: 'ENOENT' }
        gyp verb could not find "python". checking python launcher
        gyp verb could not find "python". guessing location
        gyp verb ensuring that file exists: C:\Python27\python.exe
        gyp ERR! configure error
        gyp ERR! stack Error: Can't find Python executable "python", you can set the PYTHON env variable.
        gyp ERR! stack     at PythonFinder.failNoPython
        (C:\Downloads\Wamp3\www\app\Proj\node_modules\node-gyp\lib\configure.js:492:19)
        gyp ERR! stack     at PythonFinder.<anonymous>
        (C:\Downloads\Wamp3\www\app\Proj\node_modules\node-gyp\lib\configure.js:517:16)
        gyp ERR! stack     at C:\Downloads\Wamp3\www\app\Proj\node_modules\graceful-fs\polyfills.js:284:29
        gyp ERR! stack     at FSReqWrap.oncomplete (fs.js:184:21)
        gyp ERR! System Windows_NT 10.0.17134
        gyp ERR! command "C:\\Downloads\\NodeJS\\node.exe"
        "C:\\Downloads\\Wamp3\\www\\app\\Proj\\node_modules\\node-gyp\\bin\\node-gyp.js" "rebuild" "--verbose"
        "--libsass_ext=" "--libsass_cflags=" "--libsass_ldflags=" "--libsass_library="
        gyp ERR! cwd C:\Downloads\Wamp3\www\app\Proj\node_modules\node-sass
        gyp ERR! node -v v10.4.0
        gyp ERR! node-gyp -v v3.7.0
        gyp ERR! not ok
        Build failed with error code: 1
        npm WARN optional SKIPPING OPTIONAL DEPENDENCY: fsevents@1.2.4 (node_modules\fsevents):
        npm WARN notsup SKIPPING OPTIONAL DEPENDENCY: Unsupported platform for fsevents@1.2.4: wanted
        {"os":"darwin","arch":"any"} (current: {"os":"win32","arch":"x64"})

        npm ERR! code ELIFECYCLE
        npm ERR! errno 1
        npm ERR! node-sass@4.7.2 postinstall: `node scripts/build.js`
        npm ERR! Exit status 1
        npm ERR!
        npm ERR! Failed at the node-sass@4.7.2 postinstall script.
        npm ERR! This is probably not a problem with npm. There is likely additional logging output above.

        npm ERR! A complete log of this run can be found in:
        npm ERR!     C:\Users\******\AppData\Roaming\npm-cache\_logs\2018-06-10T06_57_45_989Z-debug.log



C:\Downloads\Wamp3\www\app>

Please help me resolve this issue.

Thanks in advance!
@Neonic1 (@Neonic)