Ionic cordova build/run android FAIL


#1

Someone knows what happen, please?

FAILURE: Build failed with an exception.

  • What went wrong:
    Execution failed for task ‘:mergeDebugResources’.

Error: Failed to crunch file C:\Users\mariasantiago\Documents\Ana InovaUFRPE\SocialSecurity\platforms\android\build\intermediates\expl
oded-aar\com.google.android.gms\play-services-base\11.6.0\res\drawable-xxhdpi-v4\common_google_signin_btn_icon_light_normal_background.9
.png into C:\Users\mariasantiago\Documents\Ana InovaUFRPE\SocialSecurity\platforms\android\build\intermediates\res\merged\debug\drawable
-xxhdpi-v4\common_google_signin_btn_icon_light_normal_background.9.png

  • Try:
    Run with --stacktrace option to get the stack trace. Run with --info or --debug option to get more log output.
    Error: Failed to crunch file C:\Users\mariasantiago\Documents\Ana InovaUFRPE\SocialSecurity\platforms\android\build\intermediates\explod
    ed-aar\com.google.android.gms\play-services-base\11.6.0\res\drawable-xxhdpi-v4\common_google_signin_btn_icon_light_normal_background.9.p
    ng into C:\Users\mariasantiago\Documents\Ana InovaUFRPE\SocialSecurity\platforms\android\build\intermediates\res\merged\debug\drawable-x
    xhdpi-v4\common_google_signin_btn_icon_light_normal_background.9.png
    :mergeDebugResources FAILED

BUILD FAILED

Total time: 19.68 secs
Error: cmd: Command failed with exit code 1 Error output:
FAILURE: Build failed with an exception.

  • What went wrong:
    Execution failed for task ‘:mergeDebugResources’.

Error: Failed to crunch file C:\Users\mariasantiago\Documents\Ana InovaUFRPE\SocialSecurity\platforms\android\build\intermediates\expl
oded-aar\com.google.android.gms\play-services-base\11.6.0\res\drawable-xxhdpi-v4\common_google_signin_btn_icon_light_normal_background.9
.png into C:\Users\mariasantiago\Documents\Ana InovaUFRPE\SocialSecurity\platforms\android\build\intermediates\res\merged\debug\drawable
-xxhdpi-v4\common_google_signin_btn_icon_light_normal_background.9.png

  • Try:
    Run with --stacktrace option to get the stack trace. Run with --info or --debug option to get more log output.

[ERROR] An error occurred while running cordova build android (exit code 1).