Build failed (git push ionic master)


#1

Hello,

Since today I can’t push updates to Ionic View, the build fails :

Running with gitlab-ci-multi-runner 9.1.0 (0118d89)
  on Snapshot Builds (c9648220)
Using Shell executor...
Running on ip-10-2-174-188...
Cloning repository...
Cloning into '/home/gitlab-runner/builds/c9648220/0/project-1'...
Checking out d6644409 as master...
Skipping Git submodules setup
$ run "fetch-updates"
Checking for build process updates...
$ run "build-app"
Attempting to restore cached packages...
Package cache restored!
$ npm run build
npm info it worked if it ends with ok
npm info using npm@5.3.0
npm info using node@v8.2.1
npm info lifecycle ionic-hello-world@0.0.0~prebuild: ionic-hello-world@0.0.0
npm info lifecycle ionic-hello-world@0.0.0~build: ionic-hello-world@0.0.0

> ionic-hello-world@0.0.0 build /usr/src/app
> ionic-app-scripts build

sh: 1: ionic-app-scripts: Permission denied
npm info lifecycle ionic-hello-world@0.0.0~build: Failed to exec build script
npm ERR! code ELIFECYCLE
npm ERR! errno 126
npm ERR! ionic-hello-world@0.0.0 build: `ionic-app-scripts build`
npm ERR! Exit status 126
npm ERR! 
npm ERR! Failed at the ionic-hello-world@0.0.0 build script.
npm ERR! This is probably not a problem with npm. There is likely additional logging output above.

npm ERR! A complete log of this run can be found in:
npm ERR!     /home/gitlab-runner/.npm/_logs/2017-12-03T15_16_02_379Z-debug.log
npm run build failed
Running after script...
$ run "clean-up"
ERROR: Job failed: exit status 1

It was working 2 weeks ago but not yet today…
Can you help please??


#2

I’m having the same issue. did you find any solution already? thanks!


#3

No, I’m building a new app. I wish it will work!