Build Errors - Wont Go Away... Build Error = *;


#1

Hi,
Every time I try to build my product it keeps failing with numerous different errors (which everything should be correct so I have no idea what’s keep going on); posting all the different errors I keep getting resulted would be impossible.

Ionic Info:

[WARN] Error with .\www\lib\ionic\version.json file: FILE_NOT_FOUND, trying .\bower.json.

cli packages: (C:\Users\Eddie\AppData\Roaming\npm\node_modules)

    @ionic/cli-utils  : 1.19.2
    ionic (Ionic CLI) : 3.20.0

global packages:

    cordova (Cordova CLI) : 8.0.0
    Gulp CLI              : CLI version 3.9.1 Local version 3.9.1

local packages:

    Cordova Platforms : android 7.0.0
    Ionic Framework   : ionic1 1.3.4

System:

    Android SDK Tools : 26.1.1
    Node              : v10.4.0
    npm               : 6.1.0
    OS                : Windows 10

Environment Variables:

    ANDROID_HOME : C:\Downloads\AndroidStudio

Misc:

    backend : pro

But let me try to explain what’s going on:
>ionic start "TestBuild" blank --type ionic1: Success
>cd TestBuild: Success
>ionic cordova platform add android: Success
>ionic cordova build android: Error


c:\Users\Eddie\Documents\apps\TestBuild>ionic cordova build android
> cordova build android
Android Studio project detected

Running command: C:\Downloads\NodeJS\node.exe c:\Users\Eddie\Documents\apps\TestBuild\hooks\after_prepare\010_add_platform_class.js c:\Users\Eddie\Documents\apps\TestBuild

ANDROID_HOME=C:\Downloads\AndroidStudio
JAVA_HOME=C:\Program Files\Java\jdk1.8.0_171
studio
Subproject Path: CordovaLib
Subproject Path: app
publishNonDefault is deprecated and has no effect anymore. All variants are now published.

The Task.leftShift(Closure) method has been deprecated and is scheduled to be removed in Gradle 5.0. Please use Task.doLast(Action) instead.
        at build_51yfmn3tbvk23kfk7b2jrfkzh.run(C:\Users\Eddie\Documents\apps\TestBuild\platforms\android\app\build.gradle:143)
:CordovaLib:preBuild
 UP-TO-DATE
:CordovaLib:preDebugBuild UP-TO-DATE
:CordovaLib:compileDebugAidl
 UP-TO-DATE
:CordovaLib:compileDebugRenderscript
 UP-TO-DATE
:CordovaLib:checkDebugManifest UP-TO-DATE
:CordovaLib:generateDebugBuildConfig UP-TO-DATE
:CordovaLib:prepareLintJar UP-TO-DATE
:CordovaLib:generateDebugResValues UP-TO-DATE
:CordovaLib:generateDebugResources UP-TO-DATE
:CordovaLib:packageDebugResources UP-TO-DATE
:CordovaLib:platformAttrExtractor
 UP-TO-DATE
:CordovaLib:processDebugManifest UP-TO-DATE
:CordovaLib:processDebugResources

UP-TO-DATE
:CordovaLib:generateDebugSources UP-TO-DATE
:CordovaLib:javaPreCompileDebug UP-TO-DATE

:CordovaLib:compileDebugJavaWithJavac UP-TO-DATE
:CordovaLib:processDebugJavaRes

NO-SOURCE
:CordovaLib:transformClassesAndResourcesWithPrepareIntermediateJarsForDebug UP-TO-DATE
:app:preBuild UP-TO-DATE
:app:preDebugBuild

UP-TO-DATE
:app:compileDebugAidl
 UP-TO-DATE
:CordovaLib:packageDebugRenderscript
 NO-SOURCE
:app:compileDebugRenderscript

UP-TO-DATE
:app:checkDebugManifest UP-TO-DATE
:app:generateDebugBuildConfig UP-TO-DATE
:app:prepareLintJar UP-TO-DATE
:app:generateDebugResValues UP-TO-DATE
:app:generateDebugResources UP-TO-DATE
:app:mergeDebugResources

UP-TO-DATE
:app:createDebugCompatibleScreenManifests UP-TO-DATE
:app:processDebugManifest UP-TO-DATE
:app:splitsDiscoveryTaskDebug UP-TO-DATE
:app:processDebugResources
 UP-TO-DATE

:app:generateDebugSources UP-TO-DATE
:app:javaPreCompileDebug UP-TO-DATE
:app:compileDebugJavaWithJavac
 UP-TO-DATE

:app:compileDebugNdk NO-SOURCE
:app:compileDebugSources UP-TO-DATE
:CordovaLib:mergeDebugShaders
 UP-TO-DATE
:CordovaLib:compileDebugShaders UP-TO-DATE
:CordovaLib:generateDebugAssets UP-TO-DATE
:CordovaLib:mergeDebugAssets UP-TO-DATE
:app:mergeDebugShaders
 UP-TO-DATE
:app:compileDebugShaders UP-TO-DATE
:app:generateDebugAssets UP-TO-DATE
:app:mergeDebugAssets
 UP-TO-DATE

:app:transformClassesWithStackFramesFixerForDebug UP-TO-DATE
:app:transformClassesWithDesugarForDebug

UP-TO-DATE
:app:transformClassesWithDexBuilderForDebug

UP-TO-DATE
:app:transformDexArchiveWithExternalLibsDexMergerForDebug

UP-TO-DATE
:app:transformDexArchiveWithDexMergerForDebug UP-TO-DATE
:CordovaLib:compileDebugNdk
 NO-SOURCE
:CordovaLib:mergeDebugJniLibFolders UP-TO-DATE
:CordovaLib:transformNativeLibsWithMergeJniLibsForDebug

UP-TO-DATE
:CordovaLib:transformNativeLibsWithIntermediateJniLibsForDebug UP-TO-DATE
:app:mergeDebugJniLibFolders UP-TO-DATE
:app:transformNativeLibsWithMergeJniLibsForDebug

UP-TO-DATE
:app:processDebugJavaRes NO-SOURCE
:app:transformResourcesWithMergeJavaResForDebug

UP-TO-DATE
:app:validateSigningDebug
:app:packageDebug

UP-TO-DATE
:app:assembleDebug UP-TO-DATE
:app:cdvBuildDebug UP-TO-DATE

BUILD SUCCESSFUL in 4s
46 actionable tasks: 1 executed, 45 up-to-date

FAILURE: Build failed with an exception.

* What went wrong:
Already finished

* Try:
Run with --stacktrace option to get the stack trace. Run with --info or --debug option to get more log output.

* Get more help at https://help.gradle.org

BUILD FAILED in 4s
(node:13776) UnhandledPromiseRejectionWarning: Error: cmd: Command failed with exit code 1 Error output:
FAILURE: Build failed with an exception.

* What went wrong:
Already finished

* Try:
Run with --stacktrace option to get the stack trace. Run with --info or --debug option to get more log output.

* Get more help at https://help.gradle.org

BUILD FAILED in 4s
    at ChildProcess.whenDone (c:\Users\Eddie\Documents\apps\TestBuild\platforms\android\cordova\node_modules\cordova-common\src\superspawn.js:169:23)
    at ChildProcess.emit (events.js:182:13)
    at maybeClose (internal/child_process.js:961:16)
    at Process.ChildProcess._handle.onexit (internal/child_process.js:248:5)
(node:13776) UnhandledPromiseRejectionWarning: Unhandled promise rejection. This error originated either by throwing inside of an async function without a catch block, or by rejecting a promise which was not handled with .catch(). (rejection id: 1)
(node:13776) [DEP0018] DeprecationWarning: Unhandled promise rejections are deprecated. In the future, promise rejections that are not handled will terminate the Node.js process with a non-zero exit code.

I get errors saying build already completed (2) also, now this and a few throw errors, I've been trying to work on my app but it seems to keep breaking. I almost had my app ready for publication then it started happening out of no where.

Please help…
Thanks.