The new DateTime component is awesome!


#1

Great job on the new DateTime component ionic team!

Curious if there is a way to use it to choose a duration like “5 hours 25 mins”?

Cheers


#2

Thanks! And yes, the Picker API can do exactly that, it just needs to be documented further to show how. For now here’s an example of how to have “5 hours 25 mins”, where the numbers are scrollable/selectable, but the “suffix” descriptions stay static: https://github.com/driftyco/ionic/blob/2.0/src/components/picker/test/basic/index.ts#L168

Hope that helps


#3

Are there plans to change ion-selects to use the new Picker style as well?


#4

I tried to use it. Didn’t work. The [(ngModel)], like the documentation says to use, throws an exception No value accessor for '' when used on anything that is not an ion-input.


#5

You could use picker API.

@adam BTW how can I do loop with this picker?


#6

@xr0master The loop isn’t possible at this time, but planned to do so.


#7

You mean when the ion-datetime is not inside of an ion-input it throws an error? Would you be able to open an issue for that? Thanks


#8

@jasonwaters Yes we can add that as an interface, like how and alert or actionsheet can be used for ion-select. Still thinking on how we’d do multiple columns though, so it might even require a new component like ion-picker.


#9

@adam Any timeline on fixing the issues associated with datetime? It’s really great but currently its not ready to be used in my opinion.


Not to mention some cosmetic issues with the ion-label above it and it wont display properly under a stacked label.


#10

It works with projects .JS extension? I’m having the same problem then @KireRex.


#11

did u fix it ? I’m having the same problem ??


#12

i’m using TS and having the same problem


#13

Hi Frnd ,

I Get Some a Problem, help me.

How to Fix this Problem ionic 3 (Getting the problem in Build the .apk)

cordova build android
[19:19:11] lint finished in 4.35 s
Android Studio project detected

ANDROID_HOME=C:\Users\DINESH\AppData\Local\Android\sdk
JAVA_HOME=C:\Program Files\java\jdk1.8.0_171
studio
Subproject Path: CordovaLib
Subproject Path: app
publishNonDefault is deprecated and has no effect anymore. All variants are now published.

Configuration ‘compile’ in project ‘:app’ is deprecated. Use ‘implementation’ instead.
The Task.leftShift(Closure) method has been deprecated and is scheduled to be removed in Gradle 5.0. Please use Task.doLast(Action) instead.

    at build_dkgtsv398hh156t9h5qwddw2f.run(D:\ion\eventmanagement\platforms\android\app\build.gradle:147)

:CordovaLib:preBuild UP-TO-DATE
:CordovaLib:preDebugBuild UP-TO-DATE
:CordovaLib:compileDebugAidl

UP-TO-DATE
:CordovaLib:compileDebugRenderscript

UP-TO-DATE
:CordovaLib:checkDebugManifest
UP-TO-DATE
:CordovaLib:generateDebugBuildConfig

UP-TO-DATE
:CordovaLib:prepareLintJar UP-TO-DATE
:CordovaLib:generateDebugResValues UP-TO-DATE
:CordovaLib:generateDebugResources UP-TO-DATE
:CordovaLib:packageDebugResources

UP-TO-DATE
:CordovaLib:platformAttrExtractor UP-TO-DATE
:CordovaLib:processDebugManifest UP-TO-DATE
:CordovaLib:processDebugResources
UP-TO-DATE
:CordovaLib:generateDebugSources UP-TO-DATE
:CordovaLib:javaPreCompileDebug

UP-TO-DATE
:CordovaLib:compileDebugJavaWithJavac
UP-TO-DATE
:CordovaLib:processDebugJavaRes
NO-SOURCE
:CordovaLib:transformClassesAndResourcesWithPrepareIntermediateJarsForDebug
UP-TO-DATE
:app:preBuild UP-TO-DATE
:app:preDebugBuild

UP-TO-DATE
:app:compileDebugAidl
UP-TO-DATE

:CordovaLib:packageDebugRenderscript

NO-SOURCE
:app:compileDebugRenderscript
UP-TO-DATE
:app:checkDebugManifest UP-TO-DATE
:app:generateDebugBuildConfig UP-TO-DATE
:app:prepareLintJar UP-TO-DATE
:app:generateDebugResValues UP-TO-DATE
:app:generateDebugResources UP-TO-DATE
:app:mergeDebugResources
UP-TO-DATE
:app:createDebugCompatibleScreenManifests UP-TO-DATE

:app:processDebugManifest

UP-TO-DATE
:app:splitsDiscoveryTaskDebug UP-TO-DATE
:app:processDebugResources
D:\ion\eventmanagement\platforms\android\app\build\intermediates\manifests\full\debug\AndroidManifest.xml:106: AAPT: error: resource string/fb_app_id (aka io.ionic.starter:string/fb_app_id) not found.
D:\ion\eventmanagement\platforms\android\app\build\intermediates\manifests\full\debug\AndroidManifest.xml:109: AAPT: error: resource string/fb_app_name (aka io.ionic.starter:string/fb_app_name) not found.

D:\ion\eventmanagement\platforms\android\app\build\intermediates\manifests\full\debug\AndroidManifest.xml:113: AAPT: error: resource string/fb_app_name (aka io.ionic.starter:string/fb_app_name) not found.

D:\ion\eventmanagement\platforms\android\app\build\intermediates\manifests\full\debug\AndroidManifest.xml:106: error: resource string/fb_app_id (aka io.ionic.starter:string/fb_app_id) not found.
D:\ion\eventmanagement\platforms\android\app\build\intermediates\manifests\full\debug\AndroidManifest.xml:109: error: resource string/fb_app_name (aka io.ionic.starter:string/fb_app_name) not found.
D:\ion\eventmanagement\platforms\android\app\build\intermediates\manifests\full\debug\AndroidManifest.xml:113: error: resource string/fb_app_name (aka io.ionic.starter:string/fb_app_name) not found.
error: failed processing manifest.

Failed to execute aapt
com.android.ide.common.process.ProcessException: Failed to execute aapt
at com.android.builder.core.AndroidBuilder.processResources(AndroidBuilder.java:796)
at com.android.build.gradle.tasks.ProcessAndroidResources.invokeAaptForSplit(ProcessAndroidResources.java:551)
at com.android.build.gradle.tasks.ProcessAndroidResources.doFullTaskAction(ProcessAndroidResources.java:285)
at com.android.build.gradle.internal.tasks.IncrementalTask.taskAction(IncrementalTask.java:109)
at sun.reflect.NativeMethodAccessorImpl.invoke0(Native Method)
at sun.reflect.NativeMethodAccessorImpl.invoke(NativeMethodAccessorImpl.java:62)
at sun.reflect.DelegatingMethodAccessorImpl.invoke(DelegatingMethodAccessorImpl.java:43)
at java.lang.reflect.Method.invoke(Method.java:498)
at org.gradle.internal.reflect.JavaMethod.invoke(JavaMethod.java:73)
at org.gradle.api.internal.project.taskfactory.DefaultTaskClassInfoStore$IncrementalTaskAction.doExecute(DefaultTaskClassInfoStore.java:173)
at org.gradle.api.internal.project.taskfactory.DefaultTaskClassInfoStore$StandardTaskAction.execute(DefaultTaskClassInfoStore.java:134)
at org.gradle.api.internal.project.taskfactory.DefaultTaskClassInfoStore$StandardTaskAction.execute(DefaultTaskClassInfoStore.java:121)
at org.gradle.api.internal.tasks.execution.ExecuteActionsTaskExecuter$1.run(ExecuteActionsTaskExecuter.java:122)
at org.gradle.internal.progress.DefaultBuildOperationExecutor$RunnableBuildOperationWorker.execute(DefaultBuildOperationExecutor.java:336)
at org.gradle.internal.progress.DefaultBuildOperationExecutor$RunnableBuildOperationWorker.execute(DefaultBuildOperationExecutor.java:328)
at org.gradle.internal.progress.DefaultBuildOperationExecutor.execute(DefaultBuildOperationExecutor.java:197)
at org.gradle.internal.progress.DefaultBuildOperationExecutor.run(DefaultBuildOperationExecutor.java:107)
at org.gradle.api.internal.tasks.execution.ExecuteActionsTaskExecuter.executeAction(ExecuteActionsTaskExecuter.java:111)
at org.gradle.api.internal.tasks.execution.ExecuteActionsTaskExecuter.executeActions(ExecuteActionsTaskExecuter.java:92)
at org.gradle.api.internal.tasks.execution.ExecuteActionsTaskExecuter.execute(ExecuteActionsTaskExecuter.java:70)
at org.gradle.api.internal.tasks.execution.SkipUpToDateTaskExecuter.execute(SkipUpToDateTaskExecuter.java:63)
at org.gradle.api.internal.tasks.execution.ResolveTaskOutputCachingStateExecuter.execute(ResolveTaskOutputCachingStateExecuter.java:54)
at org.gradle.api.internal.tasks.execution.ValidatingTaskExecuter.execute(ValidatingTaskExecuter.java:58)
at org.gradle.api.internal.tasks.execution.SkipEmptySourceFilesTaskExecuter.execute(SkipEmptySourceFilesTaskExecuter.java:88)
at org.gradle.api.internal.tasks.execution.ResolveTaskArtifactStateTaskExecuter.execute(ResolveTaskArtifactStateTaskExecuter.java:52)
at org.gradle.api.internal.tasks.execution.SkipTaskWithNoActionsExecuter.execute(SkipTaskWithNoActionsExecuter.java:52)
at org.gradle.api.internal.tasks.execution.SkipOnlyIfTaskExecuter.execute(SkipOnlyIfTaskExecuter.java:54)
at org.gradle.api.internal.tasks.execution.ExecuteAtMostOnceTaskExecuter.execute(ExecuteAtMostOnceTaskExecuter.java:43)
at org.gradle.api.internal.tasks.execution.CatchExceptionTaskExecuter.execute(CatchExceptionTaskExecuter.java:34)
at org.gradle.execution.taskgraph.DefaultTaskGraphExecuter$EventFiringTaskWorker$1.run(DefaultTaskGraphExecuter.java:248)
at org.gradle.internal.progress.DefaultBuildOperationExecutor$RunnableBuildOperationWorker.execute(DefaultBuildOperationExecutor.java:336)
at org.gradle.internal.progress.DefaultBuildOperationExecutor$RunnableBuildOperationWorker.execute(DefaultBuildOperationExecutor.java:328)
at org.gradle.internal.progress.DefaultBuildOperationExecutor.execute(DefaultBuildOperationExecutor.java:197)
at org.gradle.internal.progress.DefaultBuildOperationExecutor.run(DefaultBuildOperationExecutor.java:107)
at org.gradle.execution.taskgraph.DefaultTaskGraphExecuter$EventFiringTaskWorker.execute(DefaultTaskGraphExecuter.java:241)
at org.gradle.execution.taskgraph.DefaultTaskGraphExecuter$EventFiringTaskWorker.execute(DefaultTaskGraphExecuter.java:230)
at org.gradle.execution.taskgraph.DefaultTaskPlanExecutor$TaskExecutorWorker.processTask(DefaultTaskPlanExecutor.java:124)
at org.gradle.execution.taskgraph.DefaultTaskPlanExecutor$TaskExecutorWorker.access$200(DefaultTaskPlanExecutor.java:80)
at org.gradle.execution.taskgraph.DefaultTaskPlanExecutor$TaskExecutorWorker$1.execute(DefaultTaskPlanExecutor.java:105)
at org.gradle.execution.taskgraph.DefaultTaskPlanExecutor$TaskExecutorWorker$1.execute(DefaultTaskPlanExecutor.java:99)
at org.gradle.execution.taskgraph.DefaultTaskExecutionPlan.execute(DefaultTaskExecutionPlan.java:625)
at org.gradle.execution.taskgraph.DefaultTaskExecutionPlan.executeWithTask(DefaultTaskExecutionPlan.java:580)
at org.gradle.execution.taskgraph.DefaultTaskPlanExecutor$TaskExecutorWorker.run(DefaultTaskPlanExecutor.java:99)
at org.gradle.internal.concurrent.ExecutorPolicy$CatchAndRecordFailures.onExecute(ExecutorPolicy.java:63)
at org.gradle.internal.concurrent.ManagedExecutorImpl$1.run(ManagedExecutorImpl.java:46)
at java.util.concurrent.ThreadPoolExecutor.runWorker(ThreadPoolExecutor.java:1149)
at java.util.concurrent.ThreadPoolExecutor$Worker.run(ThreadPoolExecutor.java:624)
at org.gradle.internal.concurrent.ThreadFactoryImpl$ManagedThreadRunnable.run(ThreadFactoryImpl.java:55)
at java.lang.Thread.run(Thread.java:748)
Caused by: java.util.concurrent.ExecutionException: java.util.concurrent.ExecutionException: com.android.tools.aapt2.Aapt2Exception: AAPT2 error: check logs for details
at com.google.common.util.concurrent.AbstractFuture.getDoneValue(AbstractFuture.java:503)
at com.google.common.util.concurrent.AbstractFuture.get(AbstractFuture.java:482)
at com.google.common.util.concurrent.AbstractFuture$TrustedFuture.get(AbstractFuture.java:79)
at com.android.builder.core.AndroidBuilder.processResources(AndroidBuilder.java:794)
… 48 more
Caused by: java.util.concurrent.ExecutionException: com.android.tools.aapt2.Aapt2Exception: AAPT2 error: check logs for details
at com.google.common.util.concurrent.AbstractFuture.getDoneValue(AbstractFuture.java:503)
at com.google.common.util.concurrent.AbstractFuture.get(AbstractFuture.java:462)
at com.google.common.util.concurrent.AbstractFuture$TrustedFuture.get(AbstractFuture.java:79)

    at com.android.builder.internal.aapt.v2.QueueableAapt2.lambda$makeValidatedPackage$1(QueueableAapt2.java:179)
    at java.util.concurrent.ThreadPoolExecutor.runWorker(ThreadPoolExecutor.java:1149)
    at java.util.concurrent.ThreadPoolExecutor$Worker.run(ThreadPoolExecutor.java:624)
    ... 1 more

Caused by: com.android.tools.aapt2.Aapt2Exception: AAPT2 error: check logs for details
at com.android.builder.png.AaptProcess$NotifierProcessOutput.handleOutput(AaptProcess.java:454)
at com.android.builder.png.AaptProcess$NotifierProcessOutput.err(AaptProcess.java:411)
at com.android.builder.png.AaptProcess$ProcessOutputFacade.err(AaptProcess.java:332)
at com.android.utils.GrabProcessOutput$1.run(GrabProcessOutput.java:104)

FAILED

FAILURE: Build failed with an exception.

  • What went wrong:
    Execution failed for task ‘:app:processDebugResources’.

Failed to execute aapt

  • Try:
    Run with --stacktrace option to get the stack trace. Run with --info or --debug option to get more log output.

  • Get more help at https://help.gradle.org

BUILD FAILED
25 actionable tasks: 1 executed, 24 up-to-date
in 42s

(node:21224) UnhandledPromiseRejectionWarning: Error: cmd: Command failed with exit code 1 Error output:
D:\ion\eventmanagement\platforms\android\app\build\intermediates\manifests\full\debug\AndroidManifest.xml:106: AAPT: error: resource string/fb_app_id (aka io.ionic.starter:string/fb_app_id) not found.
D:\ion\eventmanagement\platforms\android\app\build\intermediates\manifests\full\debug\AndroidManifest.xml:109: AAPT: error: resource string/fb_app_name (aka io.ionic.starter:string/fb_app_name) not found.

D:\ion\eventmanagement\platforms\android\app\build\intermediates\manifests\full\debug\AndroidManifest.xml:113: AAPT: error: resource string/fb_app_name (aka io.ionic.starter:string/fb_app_name) not found.

D:\ion\eventmanagement\platforms\android\app\build\intermediates\manifests\full\debug\AndroidManifest.xml:106: error: resource string/fb_app_id (aka io.ionic.starter:string/fb_app_id) not found.
D:\ion\eventmanagement\platforms\android\app\build\intermediates\manifests\full\debug\AndroidManifest.xml:109: error: resource string/fb_app_name (aka io.ionic.starter:string/fb_app_name) not found.
D:\ion\eventmanagement\platforms\android\app\build\intermediates\manifests\full\debug\AndroidManifest.xml:113: error: resource string/fb_app_name (aka io.ionic.starter:string/fb_app_name) not found.
error: failed processing manifest.

Failed to execute aapt
com.android.ide.common.process.ProcessException: Failed to execute aapt
at com.android.builder.core.AndroidBuilder.processResources(AndroidBuilder.java:796)
at com.android.build.gradle.tasks.ProcessAndroidResources.invokeAaptForSplit(ProcessAndroidResources.java:551)
at com.android.build.gradle.tasks.ProcessAndroidResources.doFullTaskAction(ProcessAndroidResources.java:285)
at com.android.build.gradle.internal.tasks.IncrementalTask.taskAction(IncrementalTask.java:109)
at sun.reflect.NativeMethodAccessorImpl.invoke0(Native Method)
at sun.reflect.NativeMethodAccessorImpl.invoke(NativeMethodAccessorImpl.java:62)
at sun.reflect.DelegatingMethodAccessorImpl.invoke(DelegatingMethodAccessorImpl.java:43)
at java.lang.reflect.Method.invoke(Method.java:498)
at org.gradle.internal.reflect.JavaMethod.invoke(JavaMethod.java:73)
at org.gradle.api.internal.project.taskfactory.DefaultTaskClassInfoStore$IncrementalTaskAction.doExecute(DefaultTaskClassInfoStore.java:173)
at org.gradle.api.internal.project.taskfactory.DefaultTaskClassInfoStore$StandardTaskAction.execute(DefaultTaskClassInfoStore.java:134)
at org.gradle.api.internal.project.taskfactory.DefaultTaskClassInfoStore$StandardTaskAction.execute(DefaultTaskClassInfoStore.java:121)
at org.gradle.api.internal.tasks.execution.ExecuteActionsTaskExecuter$1.run(ExecuteActionsTaskExecuter.java:122)
at org.gradle.internal.progress.DefaultBuildOperationExecutor$RunnableBuildOperationWorker.execute(DefaultBuildOperationExecutor.java:336)
at org.gradle.internal.progress.DefaultBuildOperationExecutor$RunnableBuildOperationWorker.execute(DefaultBuildOperationExecutor.java:328)
at org.gradle.internal.progress.DefaultBuildOperationExecutor.execute(DefaultBuildOperationExecutor.java:197)
at org.gradle.internal.progress.DefaultBuildOperationExecutor.run(DefaultBuildOperationExecutor.java:107)
at org.gradle.api.internal.tasks.execution.ExecuteActionsTaskExecuter.executeAction(ExecuteActionsTaskExecuter.java:111)
at org.gradle.api.internal.tasks.execution.ExecuteActionsTaskExecuter.executeActions(ExecuteActionsTaskExecuter.java:92)
at org.gradle.api.internal.tasks.execution.ExecuteActionsTaskExecuter.execute(ExecuteActionsTaskExecuter.java:70)
at org.gradle.api.internal.tasks.execution.SkipUpToDateTaskExecuter.execute(SkipUpToDateTaskExecuter.java:63)
at org.gradle.api.internal.tasks.execution.ResolveTaskOutputCachingStateExecuter.execute(ResolveTaskOutputCachingStateExecuter.java:54)
at org.gradle.api.internal.tasks.execution.ValidatingTaskExecuter.execute(ValidatingTaskExecuter.java:58)
at org.gradle.api.internal.tasks.execution.SkipEmptySourceFilesTaskExecuter.execute(SkipEmptySourceFilesTaskExecuter.java:88)
at org.gradle.api.internal.tasks.execution.ResolveTaskArtifactStateTaskExecuter.execute(ResolveTaskArtifactStateTaskExecuter.java:52)
at org.gradle.api.internal.tasks.execution.SkipTaskWithNoActionsExecuter.execute(SkipTaskWithNoActionsExecuter.java:52)
at org.gradle.api.internal.tasks.execution.SkipOnlyIfTaskExecuter.execute(SkipOnlyIfTaskExecuter.java:54)
at org.gradle.api.internal.tasks.execution.ExecuteAtMostOnceTaskExecuter.execute(ExecuteAtMostOnceTaskExecuter.java:43)
at org.gradle.api.internal.tasks.execution.CatchExceptionTaskExecuter.execute(CatchExceptionTaskExecuter.java:34)
at org.gradle.execution.taskgraph.DefaultTaskGraphExecuter$EventFiringTaskWorker$1.run(DefaultTaskGraphExecuter.java:248)
at org.gradle.internal.progress.DefaultBuildOperationExecutor$RunnableBuildOperationWorker.execute(DefaultBuildOperationExecutor.java:336)
at org.gradle.internal.progress.DefaultBuildOperationExecutor$RunnableBuildOperationWorker.execute(DefaultBuildOperationExecutor.java:328)
at org.gradle.internal.progress.DefaultBuildOperationExecutor.execute(DefaultBuildOperationExecutor.java:197)
at org.gradle.internal.progress.DefaultBuildOperationExecutor.run(DefaultBuildOperationExecutor.java:107)
at org.gradle.execution.taskgraph.DefaultTaskGraphExecuter$EventFiringTaskWorker.execute(DefaultTaskGraphExecuter.java:241)
at org.gradle.execution.taskgraph.DefaultTaskGraphExecuter$EventFiringTaskWorker.execute(DefaultTaskGraphExecuter.java:230)
at org.gradle.execution.taskgraph.DefaultTaskPlanExecutor$TaskExecutorWorker.processTask(DefaultTaskPlanExecutor.java:124)
at org.gradle.execution.taskgraph.DefaultTaskPlanExecutor$TaskExecutorWorker.access$200(DefaultTaskPlanExecutor.java:80)
at org.gradle.execution.taskgraph.DefaultTaskPlanExecutor$TaskExecutorWorker$1.execute(DefaultTaskPlanExecutor.java:105)
at org.gradle.execution.taskgraph.DefaultTaskPlanExecutor$TaskExecutorWorker$1.execute(DefaultTaskPlanExecutor.java:99)
at org.gradle.execution.taskgraph.DefaultTaskExecutionPlan.execute(DefaultTaskExecutionPlan.java:625)
at org.gradle.execution.taskgraph.DefaultTaskExecutionPlan.executeWithTask(DefaultTaskExecutionPlan.java:580)
at org.gradle.execution.taskgraph.DefaultTaskPlanExecutor$TaskExecutorWorker.run(DefaultTaskPlanExecutor.java:99)
at org.gradle.internal.concurrent.ExecutorPolicy$CatchAndRecordFailures.onExecute(ExecutorPolicy.java:63)
at org.gradle.internal.concurrent.ManagedExecutorImpl$1.run(ManagedExecutorImpl.java:46)
at java.util.concurrent.ThreadPoolExecutor.runWorker(ThreadPoolExecutor.java:1149)
at java.util.concurrent.ThreadPoolExecutor$Worker.run(ThreadPoolExecutor.java:624)
at org.gradle.internal.concurrent.ThreadFactoryImpl$ManagedThreadRunnable.run(ThreadFactoryImpl.java:55)
at java.lang.Thread.run(Thread.java:748)
Caused by: java.util.concurrent.ExecutionException: java.util.concurrent.ExecutionException: com.android.tools.aapt2.Aapt2Exception: AAPT2 error: check logs for details
at com.google.common.util.concurrent.AbstractFuture.getDoneValue(AbstractFuture.java:503)
at com.google.common.util.concurrent.AbstractFuture.get(AbstractFuture.java:482)
at com.google.common.util.concurrent.AbstractFuture$TrustedFuture.get(AbstractFuture.java:79)
at com.android.builder.core.AndroidBuilder.processResources(AndroidBuilder.java:794)
… 48 more
Caused by: java.util.concurrent.ExecutionException: com.android.tools.aapt2.Aapt2Exception: AAPT2 error: check logs for details
at com.google.common.util.concurrent.AbstractFuture.getDoneValue(AbstractFuture.java:503)
at com.google.common.util.concurrent.AbstractFuture.get(AbstractFuture.java:462)
at com.google.common.util.concurrent.AbstractFuture$TrustedFuture.get(AbstractFuture.java:79)
at com.android.builder.internal.aapt.v2.QueueableAapt2.lambda$makeValidatedPackage$1(QueueableAapt2.java:179)
at java.util.concurrent.ThreadPoolExecutor.runWorker(ThreadPoolExecutor.java:1149)
at java.util.concurrent.ThreadPoolExecutor$Worker.run(ThreadPoolExecutor.java:624)
… 1 more
Caused by: com.android.tools.aapt2.Aapt2Exception: AAPT2 error: check logs for details
at com.android.builder.png.AaptProcess$NotifierProcessOutput.handleOutput(AaptProcess.java:454)
at com.android.builder.png.AaptProcess$NotifierProcessOutput.err(AaptProcess.java:411)
at com.android.builder.png.AaptProcess$ProcessOutputFacade.err(AaptProcess.java:332)
at com.android.utils.GrabProcessOutput$1.run(GrabProcessOutput.java:104)

FAILURE: Build failed with an exception.

  • What went wrong:
    Execution failed for task ‘:app:processDebugResources’.

Failed to execute aapt

  • Try:
    Run with --stacktrace option to get the stack trace. Run with --info or --debug option to get more log output.

  • Get more help at https://help.gradle.org

BUILD FAILED in 42s
at ChildProcess.whenDone (D:\ion\eventmanagement\platforms\android\cordova\node_modules\cordova-common\src\superspawn.js:169:23)
at ChildProcess.emit (events.js:182:13)
at maybeClose (internal/child_process.js:961:16)
at Process.ChildProcess._handle.onexit (internal/child_process.js:248:5)
(node:21224) UnhandledPromiseRejectionWarning: Unhandled promise rejection. This error originated either by throwing inside of an async function without a catch block, or by rejecting a promise whichck, or by rejecting a promise which was not handled with .catch(). (rejection id: 1)
(node:21224) [DEP0018] DeprecationWarning: Unhandled promise rejections are deprecated. In the future, promise rejections that are not handled will terminate the Node.js process with a non-zero exit cde.js process with a non-zero exit code.


enter link description here

/**gradel **/
target=android-26
android.library.reference.1=CordovaLib
android.library.reference.2=app
cordova.system.library.1=com.android.support:support-v4:24.1.1+
cordova.gradle.include.1=cordova-plugin-badge/starter-badge.gradle
cordova.system.library.2=com.android.support:support-v4:26.+
cordova.gradle.include.2=cordova-plugin-local-notification/starter-localnotification.gradle
cordova.system.library.3=com.facebook.android:facebook-android-sdk:4.+
cordova.gradle.include.3=twitter-connect-plugin/starter-twitter.gradle
cordova.gradle.include.4=cordova-plugin-linkedin/starter-LinkedIn.gradle
cordova.gradle.include.5=cordova-plugin-mauron85-background-geolocation/starter-logtofile.gradle
cordova.system.library.4=com.google.android.gms:play-services-location:11+
cordova.system.library.5=com.android.support:support-v4:23+
cordova.gradle.include.6=cordova-android-support-gradle-release/starter-cordova-android-support-gradle-release.gradle

please help …