Ios build on appflow

I’m building Ionic cordova ios platform and I use appflow for build I got those errors:
:x: ld: framework not found Pods_on_a_trouve_

:x: clang: error: linker command failed with exit code 1 (use -v to see invocation)

** ARCHIVE FAILED **

The following build commands failed:
Ld /Users/ionic/Library/Developer/Xcode/DerivedData/on_a_trouvé-fxcrddnqjwgncwddrgcexbxvsyra/Build/Intermediates.noindex/ArchiveIntermediates/on\ a\ trouvé/InstallationBuildProductsLocation/Applications/on\ a\ trouvé.app/on\ a\ trouvé normal (in target ‘on a trouvé’ from project ‘on a trouvé’)
(1 failure)
[09:33:57]: Exit status: 65

±--------------±------------------------+
| Build environment |
±--------------±------------------------+
| xcode_path | /Applications/Xcode.app |
| gym_version | 2.194.0 |
| export_method | app-store |
| sdk | iPhoneOS15.0.sdk |
±--------------±------------------------+

[09:33:57]: ▸ Ld /Users/ionic/Library/Developer/Xcode/DerivedData/on_a_trouvé-fxcrddnqjwgncwddrgcexbxvsyra/Build/Intermediates.noindex/ArchiveIntermediates/on\ a\ trouvé/InstallationBuildProductsLocation/Applications/on\ a\ trouvé.app/on\ a\ trouvé normal (in target ‘on a trouvé’ from project ‘on a trouvé’)
[09:33:57]: ▸ cd /Users/ionic/builds/dalybouba/ios-ionic/platforms/ios
[09:33:57]: ▸ /Applications/Xcode.app/Contents/Developer/Toolchains/XcodeDefault.xctoolchain/usr/bin/clang -target arm64-apple-ios11.0 -isysroot /Applications/Xcode.app/Contents/Developer/Platforms/iPhoneOS.platform/Developer/SDKs/iPhoneOS15.0.sdk -L/Users/ionic/Library/Developer/Xcode/DerivedData/on_a_trouvé-fxcrddnqjwgncwddrgcexbxvsyra/Build/Intermediates.noindex/ArchiveIntermediates/on\ a\ trouvé/BuildProductsPath/Release-iphoneos -F/Users/ionic/Library/Developer/Xcode/DerivedData/on_a_trouvé-fxcrddnqjwgncwddrgcexbxvsyra/Build/Intermediates.noindex/ArchiveIntermediates/on\ a\ trouvé/BuildProductsPath/Release-iphoneos -F/Users/ionic/Library/Developer/Xcode/DerivedData/on_a_trouvé-fxcrddnqjwgncwddrgcexbxvsyra/Build/Intermediates.noindex/ArchiveIntermediates/on\ a\ trouvé/BuildProductsPath/Release-iphoneos/AppAuth -F/Users/ionic/Library/Developer/Xcode/DerivedData/on_a_trouvé-fxcrddnqjwgncwddrgcexbxvsyra/Build/Intermediates.noindex/ArchiveIntermediates/on\ a\ trouvé/BuildProductsPath/Release-iphoneos/Branch -F/Users/ionic/Library/Developer/Xcode/DerivedData/on_a_trouvé-fxcrddnqjwgncwddrgcexbxvsyra/Build/Intermediates.noindex/ArchiveIntermediates/on\ a\ trouvé/BuildProductsPath/Release-iphoneos/FirebaseABTesting -F/Users/ionic/Library/Developer/Xcode/DerivedData/on_a_trouvé-fxcrddnqjwgncwddrgcexbxvsyra/Build/Intermediates.noindex/ArchiveIntermediates/on\ a\ trouvé/BuildProductsPath/Release-iphoneos/FirebaseAuth -F/Users/ionic/Library/Developer/Xcode/DerivedData/on_a_trouvé-fxcrddnqjwgncwddrgcexbxvsyra/Build/Intermediates.noindex/ArchiveIntermediates/on\ a\ trouvé/BuildProductsPath/Release-iphoneos/FirebaseCore -F/Users/ionic/Library/Developer/Xcode/DerivedData/on_a_trouvé-fxcrddnqjwgncwddrgcexbxvsyra/Build/Intermediates.noindex/ArchiveIntermediates/on\ a\ trouvé/BuildProductsPath/Release-iphoneos/FirebaseCoreDiagnostics -F/Users/ionic/Library/Developer/Xcode/DerivedData/on_a_trouvé-fxcrddnqjwgncwddrgcexbxvsyra/Build/Intermediates.noindex/ArchiveIntermediates/on\ a\ trouvé/BuildProductsPath/Release-iphoneos/FirebaseCrashlytics -F/Users/ionic/Library/Developer/Xcode/DerivedData/on_a_trouvé-fxcrddnqjwgncwddrgcexbxvsyra/Build/Intermediates.noindex/ArchiveIntermediates/on\ a\ trouvé/BuildProductsPath/Release-iphoneos/FirebaseFunctions -F/Users/ionic/Library/Developer/Xcode/DerivedData/on_a_trouvé-fxcrddnqjwgncwddrgcexbxvsyra/Build/Intermediates.noindex/ArchiveIntermediates/on\ a\ trouvé/BuildProductsPath/Release-iphoneos/FirebaseInstallations -F/Users/ionic/Library/Developer/Xcode/DerivedData/on_a_trouvé-fxcrddnqjwgncwddrgcexbxvsyra/Build/Intermediates.noindex/ArchiveIntermediates/on\ a\ trouvé/BuildProductsPath/Release-iphoneos/FirebaseMessaging -F/Users/ionic/Library/Developer/Xcode/DerivedData/on_a_trouvé-fxcrddnqjwgncwddrgcexbxvsyra/Build/Intermediates.noindex/ArchiveIntermediates/on\ a\ trouvé/BuildProductsPath/Release-iphoneos/FirebasePerformance -F/Users/ionic/Library/Developer/Xcode/DerivedData/on_a_trouvé-fxcrddnqjwgncwddrgcexbxvsyra/Build/Intermediates.noindex/ArchiveIntermediates/on\ a\ trouvé/BuildProductsPath/Release-iphoneos/FirebaseRemoteConfig -F/Users/ionic/Library/Developer/Xcode/DerivedData/on_a_trouvé-fxcrddnqjwgncwddrgcexbxvsyra/Build/Intermediates.noindex/ArchiveIntermediates/on\ a\ trouvé/BuildProductsPath/Release-iphoneos/GTMAppAuth -F/Users/ionic/Library/Developer/Xcode/DerivedData/on_a_trouvé-fxcrddnqjwgncwddrgcexbxvsyra/Build/Intermediates.noindex/ArchiveIntermediates/on\ a\ trouvé/BuildProductsPath/Release-iphoneos/GTMSessionFetcher -F/Users/ionic/Library/Developer/Xcode/DerivedData/on_a_trouvé-fxcrddnqjwgncwddrgcexbxvsyra/Build/Intermediates.noindex/ArchiveIntermediates/on\ a\ trouvé/BuildProductsPath/Release-iphoneos/GoogleDataTransport -F/Users/ionic/Library/Developer/Xcode/DerivedData/on_a_trouvé-fxcrddnqjwgncwddrgcexbxvsyra/Build/Intermediates.noindex/ArchiveIntermediates/on\ a\ trouvé/BuildProductsPath/Release-iphoneos/GoogleSignIn -F/Users/ionic/Library/Developer/Xcode/DerivedData/on_a_trouvé-fxcrddnqjwgncwddrgcexbxvsyra/Build/Intermediates.noindex/ArchiveIntermediates/on\ a\ trouvé/BuildProductsPath/Release-iphoneos/GoogleUtilities -F/Users/ionic/Library/Developer/Xcode/DerivedData/on_a_trouvé-fxcrddnqjwgncwddrgcexbxvsyra/Build/Intermediates.noindex/ArchiveIntermediates/on\ a\ trouvé/BuildProductsPath/Release-iphoneos/PromisesObjC -F/Users/ionic/Library/Developer/Xcode/DerivedData/on_a_trouvé-fxcrddnqjwgncwddrgcexbxvsyra/Build/Intermediates.noindex/ArchiveIntermediates/on\ a\ trouvé/BuildProductsPath/Release-iphoneos/nanopb -F/Users/ionic/builds/dalybouba/ios-ionic/platforms/ios/Pods/FirebaseAnalytics/Frameworks -F/Users/ionic/builds/dalybouba/ios-ionic/platforms/ios/Pods/FirebaseFirestore/FirebaseFirestore -F/Users/ionic/builds/dalybouba/ios-ionic/platforms/ios/Pods/GoogleAppMeasurement/Frameworks -F/Users/ionic/Library/Developer/Xcode/DerivedData/on_a_trouvé-fxcrddnqjwgncwddrgcexbxvsyra/Build/Intermediates.noindex/ArchiveIntermediates/on\ a\ trouvé/BuildProductsPath/Release-iphoneos/XCFrameworkIntermediates/FirebaseAnalytics/AdIdSupport -F/Users/ionic/Library/Developer/Xcode/DerivedData/on_a_trouvé-fxcrddnqjwgncwddrgcexbxvsyra/Build/Intermediates.noindex/ArchiveIntermediates/on\ a\ trouvé/BuildProductsPath/Release-iphoneos/XCFrameworkIntermediates/FirebaseFirestore/Base -F/Users/ionic/Library/Developer/Xcode/DerivedData/on_a_trouvé-fxcrddnqjwgncwddrgcexbxvsyra/Build/Intermediates.noindex/ArchiveIntermediates/on\ a\ trouvé/BuildProductsPath/Release-iphoneos/XCFrameworkIntermediates/FirebaseFirestore/WithLeveldb -F/Users/ionic/Library/Developer/Xcode/DerivedData/on_a_trouvé-fxcrddnqjwgncwddrgcexbxvsyra/Build/Intermediates.noindex/ArchiveIntermediates/on\ a\ trouvé/BuildProductsPath/Release-iphoneos/XCFrameworkIntermediates/GoogleAppMeasurement/AdIdSupport -F/Users/ionic/Library/Developer/Xcode/DerivedData/on_a_trouvé-fxcrddnqjwgncwddrgcexbxvsyra/Build/Intermediates.noindex/ArchiveIntermediates/on\ a\ trouvé/BuildProductsPath/Release-iphoneos/XCFrameworkIntermediates/GoogleAppMeasurement/WithoutAdIdSupport -Fon\ a\ trouvé/Plugins/com.adjust.sdk -filelist /Users/ionic/Library/Developer/Xcode/DerivedData/on_a_trouvé-fxcrddnqjwgncwddrgcexbxvsyra/Build/Intermediates.noindex/ArchiveIntermediates/on\ a\ trouvé/IntermediateBuildFilesPath/on\ a\ trouvé.build/Release-iphoneos/on\ a\ trouvé.build/Objects-normal/arm64/on\ a\ trouvé.LinkFileList -Xlinker -rpath -Xlinker @executable_path/Frameworks -dead_strip -Xlinker -object_path_lto -Xlinker /Users/ionic/Library/Developer/Xcode/DerivedData/on_a_trouvé-fxcrddnqjwgncwddrgcexbxvsyra/Build/Intermediates.noindex/ArchiveIntermediates/on\ a\ trouvé/IntermediateBuildFilesPath/on\ a\ trouvé.build/Release-iphoneos/on\ a\ trouvé.build/Objects-normal/arm64/on\ a\ trouvé_lto.o -Xlinker -final_output -Xlinker /Applications/on\ a\ trouvé.app/on\ a\ trouvé -fobjc-arc -fobjc-link-runtime -ObjC -ObjC -lc++ -lsqlite3 -lz -framework AppAuth -framework BoringSSL-GRPC -framework Branch -framework CoreGraphics -framework CoreServices -framework CoreTelephony -framework CoreText -framework FBLPromises -framework FirebaseABTesting -framework FirebaseAnalytics -framework FirebaseAuth -framework FirebaseCore -framework FirebaseCoreDiagnostics -framework FirebaseCrashlytics -framework FirebaseFirestore -framework FirebaseFunctions -framework FirebaseInstallations -framework FirebaseMessaging -framework FirebasePerformance -framework FirebaseRemoteConfig -framework Foundation -framework GTMAppAuth -framework GTMSessionFetcher -framework GoogleAppMeasurement -framework GoogleAppMeasurementIdentitySupport -framework GoogleDataTransport -framework GoogleSignIn -framework GoogleUtilities -framework LocalAuthentication -framework SafariServices -framework Security -framework StoreKit -framework SystemConfiguration -framework UIKit -framework WebKit -framework abseil -framework gRPC-C++ -framework gRPC-Core -framework iAd -framework leveldb-library -framework nanopb -weak_framework AuthenticationServices -weak_framework UserNotifications /Users/ionic/Library/Developer/Xcode/DerivedData/on_a_trouvé-fxcrddnqjwgncwddrgcexbxvsyra/Build/Intermediates.noindex/ArchiveIntermediates/on\ a\ trouvé/BuildProductsPath/Release-iphoneos/libCordova.a -framework AdjustSdk -weak_framework AdSupport -weak_framework iAd -weak_framework CoreTelephony -weak_framework StoreKit -weak_framework AdServices -weak_framework AppTrackingTransparency -framework Security -framework SystemConfiguration -framework CoreLocation -weak_framework AudioToolbox -weak_framework AVFoundation -weak-lsqlite3 -weak_framework ImageIO -framework MessageUI -framework AuthenticationServices -framework Pods_on_a_trouve_ -weak_framework WebKit -framework Accelerate -framework Photos -framework QuartzCore -weak_framework Social -Xlinker -no_adhoc_codesign -Xlinker -dependency_info -Xlinker /Users/ionic/Library/Developer/Xcode/DerivedData/on_a_trouvé-fxcrddnqjwgncwddrgcexbxvsyra/Build/Intermediates.noindex/ArchiveIntermediates/on\ a\ trouvé/IntermediateBuildFilesPath/on\ a\ trouvé.build/Release-iphoneos/on\ a\ trouvé.build/Objects-normal/arm64/on\ a\ trouvé_dependency_info.dat -o /Users/ionic/Library/Developer/Xcode/DerivedData/on_a_trouvé-fxcrddnqjwgncwddrgcexbxvsyra/Build/Intermediates.noindex/ArchiveIntermediates/on\ a\ trouvé/InstallationBuildProductsLocation/Applications/on\ a\ trouvé.app/on\ a\ trouvé
[09:33:57]: ▸ ld: framework not found Pods_on_a_trouve_
[09:33:57]: ▸ clang: error: linker command failed with exit code 1 (use -v to see invocation)
[09:33:57]:
[09:33:57]: :arrow_up: Check out the few lines of raw xcodebuild output above for potential hints on how to solve this error