Ionic package build throws an error


#1

Hello guys i’am not hardcore coder i am a new bee for ionic…for now i am getting the below error

ANDROID_HOME=/opt/android-sdk
JAVA_HOME=/usr/lib/jvm/java-8-oracle
:wrapper

BUILD SUCCESSFUL

Total time: 0.808 secs
Subproject Path: CordovaLib
The Task.leftShift(Closure) method has been deprecated and is scheduled to be removed in Gradle 5.0. Please use Task.doLast(Action) instead.
at build_3takv9jn0y4gryvtffznlpdzq.run(/home/package/workspace/apps-ba7f85ce-8/cordova/platforms/android/build.gradle:137)
The JavaCompile.setDependencyCacheDir() method has been deprecated and is scheduled to be removed in Gradle 4.0.
Incremental java compilation is an incubating feature.
The TaskInputs.source(Object) method has been deprecated and is scheduled to be removed in Gradle 4.0. Please use TaskInputs.file(Object).skipWhenEmpty() instead.
:preBuild UP-TO-DATE
:preReleaseBuild UP-TO-DATE
:checkReleaseManifest
:preDebugBuild UP-TO-DATE
:CordovaLib:preBuild UP-TO-DATE
:CordovaLib:preDebugBuild UP-TO-DATE
:CordovaLib:checkDebugManifest
:CordovaLib:prepareDebugDependencies
:CordovaLib:compileDebugAidl
:CordovaLib:compileDebugNdk UP-TO-DATE
:CordovaLib:compileLint
:CordovaLib:copyDebugLint UP-TO-DATE
:CordovaLib:mergeDebugShaders
:CordovaLib:compileDebugShaders
:CordovaLib:generateDebugAssets
:CordovaLib:mergeDebugAssets
:CordovaLib:mergeDebugProguardFiles
:CordovaLib:packageDebugRenderscript UP-TO-DATE
:CordovaLib:compileDebugRenderscript
:CordovaLib:generateDebugResValues
:CordovaLib:generateDebugResources
:CordovaLib:packageDebugResources
:CordovaLib:processDebugManifest
:CordovaLib:generateDebugBuildConfig
:CordovaLib:processDebugResources
:CordovaLib:generateDebugSources
:CordovaLib:incrementalDebugJavaCompilationSafeguard
:CordovaLib:compileDebugJavaWithJavac
:CordovaLib:compileDebugJavaWithJavac - is not incremental (e.g. outputs have changed, no previous execution, etc.).
Note: Some input files use or override a deprecated API.
Note: Recompile with -Xlint:deprecation for details.
:CordovaLib:processDebugJavaRes UP-TO-DATE
:CordovaLib:transformResourcesWithMergeJavaResForDebug
:CordovaLib:transformClassesAndResourcesWithSyncLibJarsForDebug
:CordovaLib:mergeDebugJniLibFolders
:CordovaLib:transformNative_libsWithMergeJniLibsForDebug
:CordovaLib:transformNative_libsWithSyncJniLibsForDebug
:CordovaLib:bundleDebug
:CordovaLib:preReleaseBuild UP-TO-DATE
:CordovaLib:checkReleaseManifest
:CordovaLib:prepareReleaseDependencies
:CordovaLib:compileReleaseAidl
:CordovaLib:compileReleaseNdk UP-TO-DATE
:CordovaLib:copyReleaseLint UP-TO-DATE
:CordovaLib:mergeReleaseShaders
:CordovaLib:compileReleaseShaders
:CordovaLib:generateReleaseAssets
:CordovaLib:mergeReleaseAssets
:CordovaLib:mergeReleaseProguardFiles
:CordovaLib:packageReleaseRenderscript UP-TO-DATE
:CordovaLib:compileReleaseRenderscript
:CordovaLib:generateReleaseResValues
:CordovaLib:generateReleaseResources
:CordovaLib:packageReleaseResources
:CordovaLib:processReleaseManifest
:CordovaLib:generateReleaseBuildConfig
:CordovaLib:processReleaseResources
:CordovaLib:generateReleaseSources
:CordovaLib:incrementalReleaseJavaCompilationSafeguard
:CordovaLib:compileReleaseJavaWithJavac
:CordovaLib:compileReleaseJavaWithJavac - is not incremental (e.g. outputs have changed, no previous execution, etc.).
Note: Some input files use or override a deprecated API.
Note: Recompile with -Xlint:deprecation for details.
:CordovaLib:processReleaseJavaRes UP-TO-DATE
:CordovaLib:transformResourcesWithMergeJavaResForRelease
:CordovaLib:transformClassesAndResourcesWithSyncLibJarsForRelease
:CordovaLib:mergeReleaseJniLibFolders
:CordovaLib:transformNative_libsWithMergeJniLibsForRelease
:CordovaLib:transformNative_libsWithSyncJniLibsForRelease
:CordovaLib:bundleRelease
:prepareComAndroidSupportAnimatedVectorDrawable2531Library
:prepareComAndroidSupportAppcompatV72531Library
:prepareComAndroidSupportSupportCompat2600Alpha1Library
:prepareComAndroidSupportSupportCoreUi2600Alpha1Library
:prepareComAndroidSupportSupportCoreUtils2600Alpha1Library
:prepareComAndroidSupportSupportFragment2600Alpha1Library
:prepareComAndroidSupportSupportMediaCompat2600Alpha1Library
:prepareComAndroidSupportSupportV42600Alpha1Library
:prepareComAndroidSupportSupportVectorDrawable2531Library
:prepareOrgApacheCordovaCordovaLib623ReleaseLibrary
:prepareReleaseDependencies
:compileReleaseAidl
:compileReleaseRenderscript
:generateReleaseBuildConfig
:generateReleaseResValues
:generateReleaseResources
:mergeReleaseResources
:processReleaseManifest/home/package/workspace/apps-ba7f85ce-8/cordova/platforms/android/AndroidManifest.xml:27:9-31 Error:
Attribute meta-data#android.support.VERSION@value value=(25.3.1) from [com.android.support:appcompat-v7:25.3.1] AndroidManifest.xml:27:9-31
is also present at [com.android.support:support-v4:26.0.0-alpha1] AndroidManifest.xml:27:9-38 value=(26.0.0-alpha1).
Suggestion: add ‘tools:replace=“android:value”’ to element at AndroidManifest.xml:25:5-27:34 to override.

See http://g.co/androidstudio/manifest-merger for more information about the manifest merger.

:processReleaseManifest FAILED

FAILURE: Build failed with an exception.

  • What went wrong:
    Execution failed for task ‘:processReleaseManifest’.

Manifest merger failed : Attribute meta-data#android.support.VERSION@value value=(25.3.1) from [com.android.support:appcompat-v7:25.3.1] AndroidManifest.xml:27:9-31
is also present at [com.android.support:support-v4:26.0.0-alpha1] AndroidManifest.xml:27:9-38 value=(26.0.0-alpha1).
Suggestion: add ‘tools:replace=“android:value”’ to element at AndroidManifest.xml:25:5-27:34 to override.

  • Try:
    Run with --stacktrace option to get the stack trace. Run with --info
    BUILD FAILED

Total time: 2.42 secs
or --debug option to get more log output.
Error: /home/package/workspace/apps-ba7f85ce-8/cordova/platforms/android/gradlew: Command failed with exit code 1 Error output:
Note: Some input files use or override a deprecated API.
Note: Recompile with -Xlint:deprecation for details.
Note: Some input files use or override a deprecated API.
Note: Recompile with -Xlint:deprecation for details.
/home/package/workspace/apps-ba7f85ce-8/cordova/platforms/android/AndroidManifest.xml:27:9-31 Error:
Attribute meta-data#android.support.VERSION@value value=(25.3.1) from [com.android.support:appcompat-v7:25.3.1] AndroidManifest.xml:27:9-31
is also present at [com.android.support:support-v4:26.0.0-alpha1] AndroidManifest.xml:27:9-38 value=(26.0.0-alpha1).
Suggestion: add ‘tools:replace=“android:value”’ to element at AndroidManifest.xml:25:5-27:34 to override.

FAILURE: Build failed with an exception.

  • What went wrong:
    Execution failed for task ‘:processReleaseManifest’.

Manifest merger failed : Attribute meta-data#android.support.VERSION@value value=(25.3.1) from [com.android.support:appcompat-v7:25.3.1] AndroidManifest.xml:27:9-31
is also present at [com.android.support:support-v4:26.0.0-alpha1] AndroidManifest.xml:27:9-38 value=(26.0.0-alpha1).
Suggestion: add ‘tools:replace=“android:value”’ to element at AndroidManifest.xml:25:5-27:34 to override.

  • Try:
    Run with --stacktrace option to get the stack trace. Run with --info or --debug option to get more log output.

I dont know how to solve this error can any one help me thanks for advance


#2

I got a similar error recently, and resolved it by using this method :wink:

  1. Update the Gradle programm to latest version !

  2. Remove all the project’s build structure by deleting this folder : [ProjectFolder]/platforms/android

  3. Rebuild the project’s build structure by typing :
    ionic cordova build android

I hope it helps you.


#3

Just follow this path inside your project folder:

/platforms/android/project.properties

Open the file, try to find these lines from here:

target=android-26
android.library.reference.1=CordovaLib
android.library.reference.2=app
cordova.system.library.1=com.android.support:support-v4:24.1.1+
cordova.gradle.include.1=cordova-plugin-googlemaps/pushapp-tbxml-android.gradle
cordova.system.library.2=com.google.android.gms:play-services-maps:11.6.2
cordova.system.library.3=com.google.android.gms:play-services-location:11.6.2
cordova.system.library.4=com.android.support:support-core-utils:24.1.0
cordova.system.library.5=com.google.android.gms:play-services-auth:11.6.2
cordova.system.library.6=com.google.android.gms:play-services-identity:11.6.2
cordova.system.library.7=com.android.support:support-v13:26.+
cordova.system.library.8=me.leolin:ShortcutBadger:1.1.17@aar
cordova.system.library.9=com.google.firebase:firebase-messaging:11.6.2
cordova.gradle.include.2=phonegap-plugin-push/pushapp-push.gradle
cordova.system.library.10=com.android.support:support-v4:25.+
cordova.system.library.11=com.android.support:appcompat-v7:25.+

and, replace last 2 lines with

cordova.system.library.10=com.android.support:support-v4:26.+

cordova.system.library.11=com.android.support:appcompat-v7:26.+

Then run/build your ionic project…
Enjoy… :+1: