Ionic 4: Execution failed for task ':app:processDebugResources'

Hi,

I recently came across an error message saying

C:\Users\user\Documents\Development\ionic\TriStar\platforms\android\app\build\intermediates\incremental\mergeDebugResources\merged.dir\values-v28\values-v28.xml:7: error: resource android:attr/dialogCornerRadius not found.
C:\Users\user\Documents\Development\ionic\TriStar\platforms\android\app\build\intermediates\incremental\mergeDebugResources\merged.dir\values-v28\values-v28.xml:11: error: resource android:attr/dialogCornerRadius not found.
C:\Users\user\Documents\Development\ionic\TriStar\platforms\android\app\build\intermediates\incremental\mergeDebugResources\merged.dir\values\values.xml:229: error: resource android:attr/fontVariationSettings not found.
C:\Users\user\Documents\Development\ionic\TriStar\platforms\android\app\build\intermediates\incremental\mergeDebugResources\merged.dir\values\values.xml:229: error: resource android:attr/ttcIndex not found.
error: failed linking references.
FAILURE: Build failed with an exception.

* What went wrong:
Execution failed for task ':app:processDebugResources'.
> Failed to execute aapt

* Try:
Run with --stacktrace option to get the stack trace. Run with --info or --debug option to get more log output.

* Get more help at https://help.gradle.org

BUILD FAILED in 59ss'**

i was able to build fine in the morning, but when i came back from lunch, i instantly got this error.

i have tried to remove and add android back, but that was no luck.
after that i tried to add the following in my platform/android/project.properties

from

cordova.system.library.2=com.android.support:support-v4:27+

to

cordova.system.library.2=com.android.support:support-v4:27.1.0

in between building i had added file opener plugin and androidpermissions plugin, but im unsure if this would cause the problem. i have uninstalled androidpermissions and that didn’t work. i have also uninstalled the file opener but this didn’t work either.

ionic info

Ionic:

   ionic (Ionic CLI)             : 4.10.3 (C:\Users\user\AppData\Roaming\npm\node_modules\ionic)
   Ionic Framework               : @ionic/angular 4.0.2
   @angular-devkit/build-angular : 0.12.4
   @angular-devkit/schematics    : 7.2.4
   @angular/cli                  : 7.2.4
   @ionic/angular-toolkit        : 1.4.0

Cordova:

   cordova (Cordova CLI) : not installed
   Cordova Platforms     : android 7.1.4, ios 4.5.5
   Cordova Plugins       : cordova-plugin-ionic-keyboard 2.1.3, cordova-plugin-ionic-webview 3.1.2, (and 11 other plugins)

System:

   NodeJS : v10.15.1 (C:\Program Files\nodejs\node.exe)
   npm    : 6.4.1
   OS     : Windows 10

thanks
~benvo

fixed by installing the following package

cordova plugin add cordova-android-support-gradle-release --fetch
1 Like

I tried this solution but it didn’t work. Once i remove the cordova firebase plugin it starts working. I don’t know why the firebase plugin is raising this issue.

1 Like

I have the same problem and no solution described solved my problem.

Ionic:

   ionic (Ionic CLI)  : 4.10.3 (C:\Users\claudinei\AppData\Roaming\npm\node_modules\ionic)
   Ionic Framework    : ionic-angular 3.9.2
   @ionic/app-scripts : 3.2.2

Cordova:

   cordova (Cordova CLI) : 8.1.2 (cordova-lib@8.1.1)
   Cordova Platforms     : android 7.1.4, browser 5.0.4
   Cordova Plugins       : cordova-plugin-ionic-webview 1.2.1, (and 16 other plugins)

System:

   Android SDK Tools : 26.1.1 (C:\Users\claudinei\AppData\Local\Android\Sdk)
   NodeJS            : v10.16.0 (C:\Program Files\nodejs\node.exe)
   npm               : 6.9.0
   OS                : Windows 10
:app:processDebugResourcesC:\Users\claudinei\.gradle\caches\transforms-1\files-1.1\core-1.0.0.aar\9b4164a339ef204f804a401e24556af8\res\values\values.xml:133:5-70: AAPT: error: resource android:attr/fontVariationSettings not found.

C:\Users\claudinei\.gradle\caches\transforms-1\files-1.1\core-1.0.0.aar\9b4164a339ef204f804a401e24556af8\res\values\values.xml:133:5-70: AAPT: error: resource android:attr/ttcIndex not found.

C:\Users\claudinei\projetos\risa-app\risa-app-novo\platforms\android\app\build\intermediates\incremental\mergeDebugResources\merged.dir\values\values.xml:98: error: resource android:attr/fontVariationSettings not found.
C:\Users\claudinei\projetos\risa-app\risa-app-novo\platforms\android\app\build\intermediates\incremental\mergeDebugResources\merged.dir\values\values.xml:98: error: resource android:attr/ttcIndex not found.
error: failed linking references.

Failed to execute aapt
com.android.ide.common.process.ProcessException: Failed to execute aapt
        at com.android.builder.core.AndroidBuilder.processResources(AndroidBuilder.java:796)
        at com.android.build.gradle.tasks.ProcessAndroidResources.invokeAaptForSplit(ProcessAndroidResources.java:551)
        at com.android.build.gradle.tasks.ProcessAndroidResources.doFullTaskAction(ProcessAndroidResources.java:285)
        at com.android.build.gradle.internal.tasks.IncrementalTask.taskAction(IncrementalTask.java:109)
        at sun.reflect.GeneratedMethodAccessor419.invoke(Unknown Source)
        at sun.reflect.DelegatingMethodAccessorImpl.invoke(DelegatingMethodAccessorImpl.java:43)
        at java.lang.reflect.Method.invoke(Method.java:498)
        at org.gradle.internal.reflect.JavaMethod.invoke(JavaMethod.java:73)
        at org.gradle.api.internal.project.taskfactory.DefaultTaskClassInfoStore$IncrementalTaskAction.doExecute(DefaultTaskClassInfoStore.java:173)
        at org.gradle.api.internal.project.taskfactory.DefaultTaskClassInfoStore$StandardTaskAction.execute(DefaultTaskClassInfoStore.java:134)
        at org.gradle.api.internal.project.taskfactory.DefaultTaskClassInfoStore$StandardTaskAction.execute(DefaultTaskClassInfoStore.java:121)
        at org.gradle.api.internal.tasks.execution.ExecuteActionsTaskExecuter$1.run(ExecuteActionsTaskExecuter.java:122)
        at org.gradle.internal.progress.DefaultBuildOperationExecutor$RunnableBuildOperationWorker.execute(DefaultBuildOperationExecutor.java:336)
        at org.gradle.internal.progress.DefaultBuildOperationExecutor$RunnableBuildOperationWorker.execute(DefaultBuildOperationExecutor.java:328)
        at org.gradle.internal.progress.DefaultBuildOperationExecutor.execute(DefaultBuildOperationExecutor.java:197)
        at org.gradle.internal.progress.DefaultBuildOperationExecutor.run(DefaultBuildOperationExecutor.java:107)
        at org.gradle.api.internal.tasks.execution.ExecuteActionsTaskExecuter.executeAction(ExecuteActionsTaskExecuter.java:111)
        at org.gradle.api.internal.tasks.execution.ExecuteActionsTaskExecuter.executeActions(ExecuteActionsTaskExecuter.java:92)
        at org.gradle.api.internal.tasks.execution.ExecuteActionsTaskExecuter.execute(ExecuteActionsTaskExecuter.java:70)
        at org.gradle.api.internal.tasks.execution.SkipUpToDateTaskExecuter.execute(SkipUpToDateTaskExecuter.java:63)
        at org.gradle.api.internal.tasks.execution.ResolveTaskOutputCachingStateExecuter.execute(ResolveTaskOutputCachingStateExecuter.java:54)
        at org.gradle.api.internal.tasks.execution.ValidatingTaskExecuter.execute(ValidatingTaskExecuter.java:58)
        at org.gradle.api.internal.tasks.execution.SkipEmptySourceFilesTaskExecuter.execute(SkipEmptySourceFilesTaskExecuter.java:88)
        at org.gradle.api.internal.tasks.execution.ResolveTaskArtifactStateTaskExecuter.execute(ResolveTaskArtifactStateTaskExecuter.java:52)
        at org.gradle.api.internal.tasks.execution.SkipTaskWithNoActionsExecuter.execute(SkipTaskWithNoActionsExecuter.java:52)
        at org.gradle.api.internal.tasks.execution.SkipOnlyIfTaskExecuter.execute(SkipOnlyIfTaskExecuter.java:54)
        at org.gradle.api.internal.tasks.execution.ExecuteAtMostOnceTaskExecuter.execute(ExecuteAtMostOnceTaskExecuter.java:43)
        at org.gradle.api.internal.tasks.execution.CatchExceptionTaskExecuter.execute(CatchExceptionTaskExecuter.java:34)
        at org.gradle.execution.taskgraph.DefaultTaskGraphExecuter$EventFiringTaskWorker$1.run(DefaultTaskGraphExecuter.java:248)
        at org.gradle.internal.progress.DefaultBuildOperationExecutor$RunnableBuildOperationWorker.execute(DefaultBuildOperationExecutor.java:336)
        at org.gradle.internal.progress.DefaultBuildOperationExecutor$RunnableBuildOperationWorker.execute(DefaultBuildOperationExecutor.java:328)
        at org.gradle.internal.progress.DefaultBuildOperationExecutor.execute(DefaultBuildOperationExecutor.java:197)
        at org.gradle.internal.progress.DefaultBuildOperationExecutor.run(DefaultBuildOperationExecutor.java:107)
        at org.gradle.execution.taskgraph.DefaultTaskGraphExecuter$EventFiringTaskWorker.execute(DefaultTaskGraphExecuter.java:241)
        at org.gradle.execution.taskgraph.DefaultTaskGraphExecuter$EventFiringTaskWorker.execute(DefaultTaskGraphExecuter.java:230)
        at org.gradle.execution.taskgraph.DefaultTaskPlanExecutor$TaskExecutorWorker.processTask(DefaultTaskPlanExecutor.java:124)
        at org.gradle.execution.taskgraph.DefaultTaskPlanExecutor$TaskExecutorWorker.access$200(DefaultTaskPlanExecutor.java:80)
        at org.gradle.execution.taskgraph.DefaultTaskPlanExecutor$TaskExecutorWorker$1.execute(DefaultTaskPlanExecutor.java:105)
        at org.gradle.execution.taskgraph.DefaultTaskPlanExecutor$TaskExecutorWorker$1.execute(DefaultTaskPlanExecutor.java:99)
        at org.gradle.execution.taskgraph.DefaultTaskExecutionPlan.execute(DefaultTaskExecutionPlan.java:625)
        at org.gradle.execution.taskgraph.DefaultTaskExecutionPlan.executeWithTask(DefaultTaskExecutionPlan.java:580)
        at org.gradle.execution.taskgraph.DefaultTaskPlanExecutor$TaskExecutorWorker.run(DefaultTaskPlanExecutor.java:99)
        at org.gradle.internal.concurrent.ExecutorPolicy$CatchAndRecordFailures.onExecute(ExecutorPolicy.java:63)
        at org.gradle.internal.concurrent.ManagedExecutorImpl$1.run(ManagedExecutorImpl.java:46)
        at java.util.concurrent.ThreadPoolExecutor.runWorker(ThreadPoolExecutor.java:1149)
        at java.util.concurrent.ThreadPoolExecutor$Worker.run(ThreadPoolExecutor.java:624)
        at org.gradle.internal.concurrent.ThreadFactoryImpl$ManagedThreadRunnable.run(ThreadFactoryImpl.java:55)
        at java.lang.Thread.run(Thread.java:748)
Caused by: java.util.concurrent.ExecutionException: java.util.concurrent.ExecutionException: com.android.tools.aapt2.Aapt2Exception: AAPT2
error: check logs for details
        at com.google.common.util.concurrent.AbstractFuture.getDoneValue(AbstractFuture.java:503)
        at com.google.common.util.concurrent.AbstractFuture.get(AbstractFuture.java:482)
        at com.google.common.util.concurrent.AbstractFuture$TrustedFuture.get(AbstractFuture.java:79)
        at com.android.builder.core.AndroidBuilder.processResources(AndroidBuilder.java:794)
        ... 47 more
Caused by: java.util.concurrent.ExecutionException: com.android.tools.aapt2.Aapt2Exception: AAPT2 error: check logs for details
        at com.google.common.util.concurrent.AbstractFuture.getDoneValue(AbstractFuture.java:503)
        at com.google.common.util.concurrent.AbstractFuture.get(AbstractFuture.java:462)
        at com.google.common.util.concurrent.AbstractFuture$TrustedFuture.get(AbstractFuture.java:79)
        at com.android.builder.internal.aapt.v2.QueueableAapt2.lambda$makeValidatedPackage$1(QueueableAapt2.java:179)
        at java.util.concurrent.ThreadPoolExecutor.runWorker(ThreadPoolExecutor.java:1149)
        at java.util.concurrent.ThreadPoolExecutor$Worker.run(ThreadPoolExecutor.java:624)
 FAILED
33 actionable tasks: 6 executed, 27 up-to-date
        ... 1 more
Caused by: com.android.tools.aapt2.Aapt2Exception: AAPT2 error: check logs for details
        at com.android.builder.png.AaptProcess$NotifierProcessOutput.handleOutput(AaptProcess.java:463)
        at com.android.builder.png.AaptProcess$NotifierProcessOutput.err(AaptProcess.java:415)
        at com.android.builder.png.AaptProcess$ProcessOutputFacade.err(AaptProcess.java:332)
        at com.android.utils.GrabProcessOutput$1.run(GrabProcessOutput.java:104)

FAILURE: Build failed with an exception.

* What went wrong:
Execution failed for task ':app:processDebugResources'.
> Failed to execute aapt

* Try:
Run with --stacktrace option to get the stack trace. Run with --info or --debug option to get more log output.

* Get more help at https://help.gradle.org

BUILD FAILED in 22s
cmd: Command failed with exit code 1 Error output:
C:\Users\claudinei\.gradle\caches\transforms-1\files-1.1\core-1.0.0.aar\9b4164a339ef204f804a401e24556af8\res\values\values.xml:133:5-70: AAPT: error: resource android:attr/fontVariationSettings not found.

C:\Users\claudinei\.gradle\caches\transforms-1\files-1.1\core-1.0.0.aar\9b4164a339ef204f804a401e24556af8\res\values\values.xml:133:5-70: AAPT: error: resource android:attr/ttcIndex not found.

C:\Users\claudinei\projetos\risa-app\risa-app-novo\platforms\android\app\build\intermediates\incremental\mergeDebugResources\merged.dir\values\values.xml:98: error: resource android:attr/fontVariationSettings not found.
C:\Users\claudinei\projetos\risa-app\risa-app-novo\platforms\android\app\build\intermediates\incremental\mergeDebugResources\merged.dir\values\values.xml:98: error: resource android:attr/ttcIndex not found.
error: failed linking references.

Failed to execute aapt
com.android.ide.common.process.ProcessException: Failed to execute aapt
        at com.android.builder.core.AndroidBuilder.processResources(AndroidBuilder.java:796)
        at com.android.build.gradle.tasks.ProcessAndroidResources.invokeAaptForSplit(ProcessAndroidResources.java:551)
        at com.android.build.gradle.tasks.ProcessAndroidResources.doFullTaskAction(ProcessAndroidResources.java:285)
        at com.android.build.gradle.internal.tasks.IncrementalTask.taskAction(IncrementalTask.java:109)
        at sun.reflect.GeneratedMethodAccessor419.invoke(Unknown Source)
        at sun.reflect.DelegatingMethodAccessorImpl.invoke(DelegatingMethodAccessorImpl.java:43)
        at java.lang.reflect.Method.invoke(Method.java:498)
        at org.gradle.internal.reflect.JavaMethod.invoke(JavaMethod.java:73)
        at org.gradle.api.internal.project.taskfactory.DefaultTaskClassInfoStore$IncrementalTaskAction.doExecute(DefaultTaskClassInfoStore.java:173)
        at org.gradle.api.internal.project.taskfactory.DefaultTaskClassInfoStore$StandardTaskAction.execute(DefaultTaskClassInfoStore.java:134)
        at org.gradle.api.internal.project.taskfactory.DefaultTaskClassInfoStore$StandardTaskAction.execute(DefaultTaskClassInfoStore.java:121)
        at org.gradle.api.internal.tasks.execution.ExecuteActionsTaskExecuter$1.run(ExecuteActionsTaskExecuter.java:122)
        at org.gradle.internal.progress.DefaultBuildOperationExecutor$RunnableBuildOperationWorker.execute(DefaultBuildOperationExecutor.java:336)
        at org.gradle.internal.progress.DefaultBuildOperationExecutor$RunnableBuildOperationWorker.execute(DefaultBuildOperationExecutor.java:328)
        at org.gradle.internal.progress.DefaultBuildOperationExecutor.execute(DefaultBuildOperationExecutor.java:197)
        at org.gradle.internal.progress.DefaultBuildOperationExecutor.run(DefaultBuildOperationExecutor.java:107)
        at org.gradle.api.internal.tasks.execution.ExecuteActionsTaskExecuter.executeAction(ExecuteActionsTaskExecuter.java:111)
        at org.gradle.api.internal.tasks.execution.ExecuteActionsTaskExecuter.executeActions(ExecuteActionsTaskExecuter.java:92)
        at org.gradle.api.internal.tasks.execution.ExecuteActionsTaskExecuter.execute(ExecuteActionsTaskExecuter.java:70)
        at org.gradle.api.internal.tasks.execution.SkipUpToDateTaskExecuter.execute(SkipUpToDateTaskExecuter.java:63)
        at org.gradle.api.internal.tasks.execution.ResolveTaskOutputCachingStateExecuter.execute(ResolveTaskOutputCachingStateExecuter.java:54)
        at org.gradle.api.internal.tasks.execution.ValidatingTaskExecuter.execute(ValidatingTaskExecuter.java:58)
        at org.gradle.api.internal.tasks.execution.SkipEmptySourceFilesTaskExecuter.execute(SkipEmptySourceFilesTaskExecuter.java:88)
        at org.gradle.api.internal.tasks.execution.ResolveTaskArtifactStateTaskExecuter.execute(ResolveTaskArtifactStateTaskExecuter.java:52)
        at org.gradle.api.internal.tasks.execution.SkipTaskWithNoActionsExecuter.execute(SkipTaskWithNoActionsExecuter.java:52)
        at org.gradle.api.internal.tasks.execution.SkipOnlyIfTaskExecuter.execute(SkipOnlyIfTaskExecuter.java:54)
        at org.gradle.api.internal.tasks.execution.ExecuteAtMostOnceTaskExecuter.execute(ExecuteAtMostOnceTaskExecuter.java:43)
        at org.gradle.api.internal.tasks.execution.CatchExceptionTaskExecuter.execute(CatchExceptionTaskExecuter.java:34)
        at org.gradle.execution.taskgraph.DefaultTaskGraphExecuter$EventFiringTaskWorker$1.run(DefaultTaskGraphExecuter.java:248)
        at org.gradle.internal.progress.DefaultBuildOperationExecutor$RunnableBuildOperationWorker.execute(DefaultBuildOperationExecutor.java:336)
        at org.gradle.internal.progress.DefaultBuildOperationExecutor$RunnableBuildOperationWorker.execute(DefaultBuildOperationExecutor.java:328)
        at org.gradle.internal.progress.DefaultBuildOperationExecutor.execute(DefaultBuildOperationExecutor.java:197)
        at org.gradle.internal.progress.DefaultBuildOperationExecutor.run(DefaultBuildOperationExecutor.java:107)
        at org.gradle.execution.taskgraph.DefaultTaskGraphExecuter$EventFiringTaskWorker.execute(DefaultTaskGraphExecuter.java:241)
        at org.gradle.execution.taskgraph.DefaultTaskGraphExecuter$EventFiringTaskWorker.execute(DefaultTaskGraphExecuter.java:230)
        at org.gradle.execution.taskgraph.DefaultTaskPlanExecutor$TaskExecutorWorker.processTask(DefaultTaskPlanExecutor.java:124)
        at org.gradle.execution.taskgraph.DefaultTaskPlanExecutor$TaskExecutorWorker.access$200(DefaultTaskPlanExecutor.java:80)
        at org.gradle.execution.taskgraph.DefaultTaskPlanExecutor$TaskExecutorWorker$1.execute(DefaultTaskPlanExecutor.java:105)
        at org.gradle.execution.taskgraph.DefaultTaskPlanExecutor$TaskExecutorWorker$1.execute(DefaultTaskPlanExecutor.java:99)
        at org.gradle.execution.taskgraph.DefaultTaskExecutionPlan.execute(DefaultTaskExecutionPlan.java:625)
        at org.gradle.execution.taskgraph.DefaultTaskExecutionPlan.executeWithTask(DefaultTaskExecutionPlan.java:580)
        at org.gradle.execution.taskgraph.DefaultTaskPlanExecutor$TaskExecutorWorker.run(DefaultTaskPlanExecutor.java:99)
        at org.gradle.internal.concurrent.ExecutorPolicy$CatchAndRecordFailures.onExecute(ExecutorPolicy.java:63)
        at org.gradle.internal.concurrent.ManagedExecutorImpl$1.run(ManagedExecutorImpl.java:46)
        at java.util.concurrent.ThreadPoolExecutor.runWorker(ThreadPoolExecutor.java:1149)
        at java.util.concurrent.ThreadPoolExecutor$Worker.run(ThreadPoolExecutor.java:624)
        at org.gradle.internal.concurrent.ThreadFactoryImpl$ManagedThreadRunnable.run(ThreadFactoryImpl.java:55)
        at java.lang.Thread.run(Thread.java:748)
Caused by: java.util.concurrent.ExecutionException: java.util.concurrent.ExecutionException: com.android.tools.aapt2.Aapt2Exception: AAPT2
error: check logs for details
        at com.google.common.util.concurrent.AbstractFuture.getDoneValue(AbstractFuture.java:503)
        at com.google.common.util.concurrent.AbstractFuture.get(AbstractFuture.java:482)
        at com.google.common.util.concurrent.AbstractFuture$TrustedFuture.get(AbstractFuture.java:79)
        at com.android.builder.core.AndroidBuilder.processResources(AndroidBuilder.java:794)
        ... 47 more
Caused by: java.util.concurrent.ExecutionException: com.android.tools.aapt2.Aapt2Exception: AAPT2 error: check logs for details
        at com.google.common.util.concurrent.AbstractFuture.getDoneValue(AbstractFuture.java:503)
        at com.google.common.util.concurrent.AbstractFuture.get(AbstractFuture.java:462)
        at com.google.common.util.concurrent.AbstractFuture$TrustedFuture.get(AbstractFuture.java:79)
        at com.android.builder.internal.aapt.v2.QueueableAapt2.lambda$makeValidatedPackage$1(QueueableAapt2.java:179)
        at java.util.concurrent.ThreadPoolExecutor.runWorker(ThreadPoolExecutor.java:1149)
        at java.util.concurrent.ThreadPoolExecutor$Worker.run(ThreadPoolExecutor.java:624)
        ... 1 more
Caused by: com.android.tools.aapt2.Aapt2Exception: AAPT2 error: check logs for details
        at com.android.builder.png.AaptProcess$NotifierProcessOutput.handleOutput(AaptProcess.java:463)
        at com.android.builder.png.AaptProcess$NotifierProcessOutput.err(AaptProcess.java:415)
        at com.android.builder.png.AaptProcess$ProcessOutputFacade.err(AaptProcess.java:332)
        at com.android.utils.GrabProcessOutput$1.run(GrabProcessOutput.java:104)

FAILURE: Build failed with an exception.

* What went wrong:
Execution failed for task ':app:processDebugResources'.
> Failed to execute aapt

* Try:
Run with --stacktrace option to get the stack trace. Run with --info or --debug option to get more log output.

* Get more help at https://help.gradle.org

BUILD FAILED in 22s
PS C:\Users\claudinei\projetos\risa-app\risa-app-novo> ionic info
1 Like

Hi
I get same error. No solution help me.

ionic: 4.12.0
cordova: 8.0.0

Here is my project.properties

# Project target.
target=android-26
android.library.reference.1=CordovaLib
android.library.reference.2=app
cordova.gradle.include.1=cordova-android-support-gradle-release/zounko-cordova-android-support-gradle-release.gradle
cordova.gradle.include.2=cordova-plugin-extension/zounko-rjfun-libs.gradle
cordova.system.library.1=com.google.android.gms:play-services-ads:16.0.0
cordova.gradle.include.3=cordova-plugin-badge/zounko-badge.gradle
cordova.system.library.2=com.android.support:support-v4:24.1.1+
cordova.system.library.3=com.soundcloud.android:android-crop:1.0.0@aar
cordova.gradle.include.4=cordova-plugin-firebase/zounko-build.gradle
cordova.system.library.4=com.google.android.gms:play-services-tagmanager:+
cordova.system.library.5=com.google.firebase:firebase-core:+
cordova.system.library.6=com.google.firebase:firebase-messaging:+
cordova.system.library.7=com.google.firebase:firebase-config:+
cordova.system.library.8=com.google.firebase:firebase-perf:+
cordova.system.library.9=com.android.support:support-annotations:27.+
cordova.system.library.10=com.android.support:support-v4:26.+
cordova.gradle.include.5=cordova-plugin-local-notification/zounko-localnotification.gradle
cordova.system.library.11=com.android.support:support-v4:24.1.1+
cordova.gradle.include.6=phonegap-plugin-barcodescanner/zounko-barcodescanner.gradle
cordova.system.library.12=com.android.support:support-v4:27.+

my plugin list

cordova-android-support-gradle-release 3.0.0 "cordova-android-support-gradle-release"
cordova-plugin-admobpro-firebase 2.37.0 "AdMob Plugin Pro"
cordova-plugin-badge 0.8.8 "Badge"
cordova-plugin-camera 4.0.3 "Camera"
cordova-plugin-cocoapod-supportx 1.7.0 "Cordova CocoaPods Dependency Support"
cordova-plugin-crop 0.3.1 "CropPlugin"
cordova-plugin-device 2.0.2 "Device"
cordova-plugin-extension 1.5.4 "Cordova Plugin Extension"
cordova-plugin-file 6.0.1 "File"
cordova-plugin-file-transfer 1.7.1 "File Transfer"
cordova-plugin-firebase 2.0.5 "Google Firebase Plugin"
cordova-plugin-geolocation 4.0.1 "Geolocation"
cordova-plugin-globalization 1.11.0 "Globalization"
cordova-plugin-inappbrowser 3.0.0 "InAppBrowser"
cordova-plugin-ionic 5.3.0 "cordova-plugin-ionic"
cordova-plugin-ionic-keyboard 2.1.3 "cordova-plugin-ionic-keyboard"
cordova-plugin-ionic-webview 2.5.0 "cordova-plugin-ionic-webview"
cordova-plugin-local-notification 0.9.0-beta.2 "LocalNotification"
cordova-plugin-nativestorage 2.3.2 "NativeStorage"
cordova-plugin-splashscreen 5.0.2 "Splashscreen"
cordova-plugin-statusbar 2.4.2 "StatusBar"
cordova-plugin-whitelist 1.3.3 "Whitelist"
cordova-plugin-x-socialsharing 5.4.4 "SocialSharing"
es6-promise-plugin 4.2.2 "Promise"
ionic-plugin-deeplinks 1.0.20 "Ionic Deeplink Plugin"
phonegap-plugin-barcodescanner 8.0.1 "BarcodeScanner"

Please any help
Thank

1 Like

I have the same problem