Error after android build


#1

FAILURE: Build failed with an exception.

  • What went wrong:
    Execution failed for task ‘:transformClassesWithDexForDebug’.

com.android.build.api.transform.TransformException: com.android.ide.common.process.ProcessException: java.util.concurrent.ExecutionException: com.android.dex.DexException: Multiple dex files define Lcom/google/zxing/BarcodeFormat;