Build failed with an exception

Hello. Help.

Android Studio project detected
ANDROID_HOME=C:\Program Files\Android\android-sdk
JAVA_HOME=C:\Program Files\Java\jdk1.8.0_201
studio
Subproject Path: CordovaLib
Subproject Path: app
Starting a Gradle Daemon (subsequent builds will be faster)

FAILURE: Build failed with an exception.

  • What went wrong:
    Unable to start the daemon process.
    This problem might be caused by incorrect configuration of the daemon.
    For example, an unrecognized jvm option is used.
    Please refer to the user guide chapter on the daemon at https://docs.gradle.org/4.1/userguide/gradle_daemon.html
    Please read the following process output to find out more:

Error occurred during initialization of VM
Could not reserve enough space for 2097152KB object heap

  • Try:
    Run with --stacktrace option to get the stack trace. Run with --info or --debug option to get more log output.

  • Get more help at https://help.gradle.org
    cmd: Command failed with exit code 1 Error output:
    FAILURE: Build failed with an exception.

  • What went wrong:
    Unable to start the daemon process.
    This problem might be caused by incorrect configuration of the daemon.
    For example, an unrecognized jvm option is used.
    Please refer to the user guide chapter on the daemon at https://docs.gradle.org/4.1/userguide/gradle_daemon.html
    Please read the following process output to find out more:


Error occurred during initialization of VM
Could not reserve enough space for 2097152KB object heap

  • Try:
    Run with --stacktrace option to get the stack trace. Run with --info or --debug option to get more log output.

  • Get more help at https://help.gradle.org
    [ERROR] An error occurred while running subprocess cordova.

      cordova build android exited with exit code 1.
    
      Re-running this command with the --verbose flag may provide more information.

Running late to the party here, but I had my head banging the wall for a full day on this error yesterday, finding out that I installed 32bit JDK instead of 64bit…

Solved it for me.