Android build failed mac os


#1

build failed in android

ionic info 
cli packages: (/usr/local/lib/node_modules)

    @ionic/cli-utils  : 1.19.2
    ionic (Ionic CLI) : 3.20.0

global packages:

    cordova (Cordova CLI) : 8.0.0

local packages:

    @ionic/app-scripts : 3.1.8
    Cordova Platforms  : android 7.0.0 ios 4.5.4
    Ionic Framework    : ionic-angular 3.9.2

System:

    Android SDK Tools : 26.1.1
    ios-deploy        : 1.9.2
    ios-sim           : 6.1.2
    Node              : v8.11.1
    npm               : 5.6.0
    OS                : macOS High Sierra
    Xcode             : Xcode 9.2 Build version 9C40b

Environment Variables:

    ANDROID_HOME : /Users/anspireagency/Library/Android/sdk/

Misc:

    backend : pro
* What went wrong:
Execution failed for task ':app:transformNativeLibsWithStripDebugSymbolForDebug'.
> A problem occurred starting process 'command '/Users/anspireagency/Library/Android/sdk/ndk-bundle/toolchains/mips64el-linux-android-4.9/prebuilt/darwin-x86_64/bin/mips64el-linux-android-strip''

* Try:
Run with --stacktrace option to get the stack trace. Run with --info or --debug option to get more log output.

* Get more help at https://help.gradle.org

BUILD FAILED in 1m 45s
45 actionable tasks: 45 executed
(node:2339) UnhandledPromiseRejectionWarning: Error: /Users/anspireagency/Desktop/development/Archive 2/platforms/android/gradlew: Command failed with exit code 1 Error output:
Note: Some input files use or override a deprecated API.
Note: Recompile with -Xlint:deprecation for details.
Note: Some input files use or override a deprecated API.
Note: Recompile with -Xlint:deprecation for details.
Note: Some input files use unchecked or unsafe operations.
Note: Recompile with -Xlint:unchecked for details.

FAILURE: Build failed with an exception.

* What went wrong:
Execution failed for task ':app:transformNativeLibsWithStripDebugSymbolForDebug'.
> A problem occurred starting process 'command '/Users/anspireagency/Library/Android/sdk/ndk-bundle/toolchains/mips64el-linux-android-4.9/prebuilt/darwin-x86_64/bin/mips64el-linux-android-strip''

* Try:
Run with --stacktrace option to get the stack trace. Run with --info or --debug option to get more log output.

* Get more help at https://help.gradle.org

BUILD FAILED in 1m 45s
    at ChildProcess.whenDone (/Users/anspireagency/Desktop/development/Archive 2/platforms/android/cordova/node_modules/cordova-common/src/superspawn.js:169:23)
    at emitTwo (events.js:126:13)
    at ChildProcess.emit (events.js:214:7)
    at maybeClose (internal/child_process.js:925:16)
    at Process.ChildProcess._handle.onexit (internal/child_process.js:209:5)
(node:2339) UnhandledPromiseRejectionWarning: Unhandled promise rejection. This error originated either by throwing insideof an async function without a catch block, or by rejecting a promise which was not handled with .catch(). (rejection id: 1)
(node:2339) [DEP0018] DeprecationWarning: Unhandled promise rejections are deprecated. In the future, promise rejections that are not handled will terminate the Node.js process with a non-zero exit code.