WARNING: Your kernel does not support swap limit capabilities or the cgroup is not mounted. Memory limited without swap


#1

If i push the code to ionic and the build try to run, each build ends with

WARNING: Your kernel does not support swap limit capabilities or the cgroup is not mounted. Memory limited without swap.

I think there was a problem with docker. In the morning all worked fine. Could someone check this. One of the jos ids is 6067188.

Thanks a lot.
Torsten


#2

Hello
I’m having the same problem on my Ionic Pro account. Yet, a month ago the compilation was going well.
Did you find a solution?

cordially


#3

Hello
I’m having the same problem on my Ionic Pro account. Any a solution?


#4

@torstenzwoch did you ever resolve?


#5

I don’t think that this is actually an error message, just a warning message that appears in all builds, even successful ones. However the problem I am having is that my builds are failing immediately after this warning. The builds were working fine less than 2 hours ago.

$ npm install --quiet --no-optional
WARNING: Your kernel does not support swap limit capabilities or the cgroup is not mounted. Memory limited without swap.
npm ERR! write after end

npm ERR! A complete log of this run can be found in:
npm ERR!     /home/gitlab-runner/.npm/_logs/2018-10-31T04_05_56_968Z-debug.log
npm install --quiet --no-optional failed
Running after script...
$ run "clean-up"
Running Stage clean-up for Job: 6275123

#6

@daveywc I think they might be having issues with the VMs for packaging. Now it goes further into the build and fails randomly:

FAILURE: Build failed with an exception. * What went wrong: Execution failed for task ‘:app:transformDexWithDexForRelease’. > com.android.build.api.transform.TransformException: com.android.ide.common.process.ProcessException: java.util.concurrent.ExecutionException: com.android.dex.DexIndexOverflowException: method ID not in [0, 0xffff]: 65536