/Users/plustvadmin/Desktop/IONICPROJECTS/withSQLiteDB/plusTVguestApp/platforms/android/gradlew: Command failed with exit code 1 Error output: FAILURE: Build failed with an exception

BUILD FAILED

Total time: 8.076 secs

Error: /Users/plustvadmin/Desktop/IONICPROJECTS/withSQLiteDB/XYZAPP/platforms/android/gradlew: Command failed with exit code 1 Error output:
FAILURE: Build failed with an exception.

  • What went wrong:
    A problem occurred configuring root project ‘android’.

Could not resolve all dependencies for configuration ‘:classpath’.
Could not find com.android.tools.build:gradle:3.3.
Searched in the following locations:
https://repo1.maven.org/maven2/com/android/tools/build/gradle/3.3/gradle-3.3.pom
https://repo1.maven.org/maven2/com/android/tools/build/gradle/3.3/gradle-3.3.jar
https://jcenter.bintray.com/com/android/tools/build/gradle/3.3/gradle-3.3.pom
https://jcenter.bintray.com/com/android/tools/build/gradle/3.3/gradle-3.3.jar
Required by:
:android:unspecified

  • Try:
    Run with --stacktrace option to get the stack trace. Run with --info or --debug option to get more log output.