Unable to create project in ionic3?

Hello to all,
I have created fresh project in ionic3 with below cmd ;-
Sudo ionic start AMS tutorial
And i have got multiple errors tell me anyone how to resolve this?

RROR] An error occurred while running npm install (exit code 1):

    npm WARN deprecated browserslist@2.11.3: Browserslist 2 could fail on

    reading Browserslist >3.0 config used in other tools.

    

    > fsevents@1.2.4 install /Users/admin/Desktop/AMS/node_modules/fsevents

    > node install

    

    [fsevents] Success:

    "/Users/admin/Desktop/AMS/node_modules/fsevents/lib/binding/Release/node-v57-darwin-x64/fse.node"

    already installed

    Pass --update-binary to reinstall or --build-from-source to recompile

    

    > node-sass@4.5.3 install

    /Users/admin/Desktop/AMS/node_modules/node-sass

    > node scripts/install.js

    

    Unable to save binary

    /Users/admin/Desktop/AMS/node_modules/node-sass/vendor/darwin-x64-57 : {

    Error: EACCES: permission denied, mkdir

    '/Users/admin/Desktop/AMS/node_modules/node-sass/vendor'

    at Object.fs.mkdirSync (fs.js:885:18)

    at sync (/Users/admin/Desktop/AMS/node_modules/mkdirp/index.js:71:13)

    at Function.sync

    (/Users/admin/Desktop/AMS/node_modules/mkdirp/index.js:77:24)

    at checkAndDownloadBinary

    (/Users/admin/Desktop/AMS/node_modules/node-sass/scripts/install.js:111:11)

    at Object.<anonymous>

    (/Users/admin/Desktop/AMS/node_modules/node-sass/scripts/install.js:154:1)

    at Module._compile (module.js:653:30)

    at Object.Module._extensions..js (module.js:664:10)

    at Module.load (module.js:566:32)

    at tryModuleLoad (module.js:506:12)

    at Function.Module._load (module.js:498:3)

    errno: -13,

    code: 'EACCES',

    syscall: 'mkdir',

    path: '/Users/admin/Desktop/AMS/node_modules/node-sass/vendor' }

    

    > uglifyjs-webpack-plugin@0.4.6 postinstall

    /Users/admin/Desktop/AMS/node_modules/uglifyjs-webpack-plugin

    > node lib/post_install.js

    

    

    > node-sass@4.5.3 postinstall

    /Users/admin/Desktop/AMS/node_modules/node-sass

    > node scripts/build.js

    

    Building: /usr/local/bin/node

    /Users/admin/Desktop/AMS/node_modules/node-gyp/bin/node-gyp.js rebuild

    --verbose --libsass_ext= --libsass_cflags= --libsass_ldflags=

    --libsass_library=

    gyp info it worked if it ends with ok

    gyp verb cli [ '/usr/local/bin/node',

    gyp verb cli

    '/Users/admin/Desktop/AMS/node_modules/node-gyp/bin/node-gyp.js',

    gyp verb cli   'rebuild',

    gyp verb cli   '--verbose',

    gyp verb cli   '--libsass_ext=',

    gyp verb cli   '--libsass_cflags=',

    gyp verb cli   '--libsass_ldflags=',

    gyp verb cli   '--libsass_library=' ]

    gyp info using node-gyp@3.8.0

    gyp info using node@8.12.0 | darwin | x64

    gyp verb command rebuild []

    gyp verb command clean []

    gyp verb clean removing "build" directory

    gyp verb command configure []

    gyp verb check python checking for Python executable "python2" in the

    PATH

    gyp verb `which` failed Error: not found: python2

    gyp verb `which` failed     at getNotFoundError

    (/Users/admin/Desktop/AMS/node_modules/which/which.js:13:12)

    gyp verb `which` failed     at F

    (/Users/admin/Desktop/AMS/node_modules/which/which.js:68:19)

    gyp verb `which` failed     at E

    (/Users/admin/Desktop/AMS/node_modules/which/which.js:80:29)

    gyp verb `which` failed     at

    /Users/admin/Desktop/AMS/node_modules/which/which.js:89:16

    gyp verb `which` failed     at

    /Users/admin/Desktop/AMS/node_modules/isexe/index.js:42:5

    gyp verb `which` failed     at

    /Users/admin/Desktop/AMS/node_modules/isexe/mode.js:8:5

    gyp verb `which` failed     at FSReqWrap.oncomplete (fs.js:152:21)

    gyp verb `which` failed  python2 { Error: not found: python2

    gyp verb `which` failed     at getNotFoundError

    (/Users/admin/Desktop/AMS/node_modules/which/which.js:13:12)

    gyp verb `which` failed     at F

    (/Users/admin/Desktop/AMS/node_modules/which/which.js:68:19)

    gyp verb `which` failed     at E

    (/Users/admin/Desktop/AMS/node_modules/which/which.js:80:29)

    gyp verb `which` failed     at

    /Users/admin/Desktop/AMS/node_modules/which/which.js:89:16

    gyp verb `which` failed     at

    /Users/admin/Desktop/AMS/node_modules/isexe/index.js:42:5

    gyp verb `which` failed     at

    /Users/admin/Desktop/AMS/node_modules/isexe/mode.js:8:5

    gyp verb `which` failed     at FSReqWrap.oncomplete (fs.js:152:21)

    gyp verb `which` failed   stack: 'Error: not found: python2\n    at

    getNotFoundError

    (/Users/admin/Desktop/AMS/node_modules/which/which.js:13:12)\n    at F

    (/Users/admin/Desktop/AMS/node_modules/which/which.js:68:19)\n    at E

    (/Users/admin/Desktop/AMS/node_modules/which/which.js:80:29)\n    at

    /Users/admin/Desktop/AMS/node_modules/which/which.js:89:16\n    at

    /Users/admin/Desktop/AMS/node_modules/isexe/index.js:42:5\n    at

    /Users/admin/Desktop/AMS/node_modules/isexe/mode.js:8:5\n    at

    FSReqWrap.oncomplete (fs.js:152:21)',

    gyp verb `which` failed   code: 'ENOENT' }

    gyp verb check python checking for Python executable "python" in the

    PATH

    gyp verb `which` succeeded python /usr/bin/python

    gyp verb check python version `/usr/bin/python -c "import sys; print

    "2.7.10

    gyp verb check python version .%s.%s" % sys.version_info[:3];"`

    returned: %j

    gyp verb get node dir no --target version specified, falling back to

    host node version: 8.12.0

    gyp verb command install [ '8.12.0' ]

    gyp verb install input version string "8.12.0"

    gyp verb install installing version: 8.12.0

    gyp verb install --ensure was passed, so won't reinstall if already

    installed

    gyp verb install version is already installed, need to check

    "installVersion"

    gyp verb got "installVersion" 9

    gyp verb needs "installVersion" 9

    gyp verb install version is good

    gyp verb get node dir target node version installed: 8.12.0

    gyp verb build dir attempting to create "build" dir:

    /Users/admin/Desktop/AMS/node_modules/node-sass/build

    gyp ERR! configure error

    gyp ERR! stack Error: EACCES: permission denied, mkdir

    '/Users/admin/Desktop/AMS/node_modules/node-sass/build'

    gyp ERR! System Darwin 16.7.0

    gyp ERR! command "/usr/local/bin/node"

    "/Users/admin/Desktop/AMS/node_modules/node-gyp/bin/node-gyp.js"

    "rebuild" "--verbose" "--libsass_ext=" "--libsass_cflags="

    "--libsass_ldflags=" "--libsass_library="

    gyp ERR! cwd /Users/admin/Desktop/AMS/node_modules/node-sass

    gyp ERR! node -v v8.12.0

    gyp ERR! node-gyp -v v3.8.0

    gyp ERR! not ok

    Build failed with error code: 1

    npm ERR! code ELIFECYCLE

    npm ERR! errno 1

    npm ERR! node-sass@4.5.3 postinstall: `node scripts/build.js`

    npm ERR! Exit status 1

    npm ERR!

    npm ERR! Failed at the node-sass@4.5.3 postinstall script.

    npm ERR! This is probably not a problem with npm. There is likely

    additional logging output above.

    

    npm ERR! A complete log of this run can be found in:

    npm ERR!     /Users/admin/.npm/_logs/2018-12-28T13_41_29_841Z-debug.log