Can't install node modules


#1

I’m getting this error in the terminal every time I try to install node modules

> fsevents@1.2.4 install /Users/anspireagency/Desktop/ahmed f/Doctory/node_modules/fsevents
> node install

[fsevents] Success: "/Users/anspireagency/Desktop/ahmed f/Doctory/node_modules/fsevents/lib/binding/Release/node-v64-darwin-x64/fse.node" already installed
Pass --update-binary to reinstall or --build-from-source to recompile

> grpc@1.10.1 install /Users/anspireagency/Desktop/ahmed f/Doctory/node_modules/grpc
> node-pre-gyp install --fallback-to-build --library=static_library

node-pre-gyp ERR! Tried to download(403): https://storage.googleapis.com/grpc-precompiled-binaries/node/grpc/v1.10.1/node-v64-darwin-x64-unknown.tar.gz
node-pre-gyp ERR! Pre-built binaries not found for grpc@1.10.1 and node@10.13.0 (node-v64 ABI, unknown) (falling back to source compile with node-gyp)
node-pre-gyp ERR! Pre-built binaries not installable for grpc@1.10.1 and node@10.13.0 (node-v64 ABI, unknown) (falling back to source compile with node-gyp)
node-pre-gyp ERR! Hit error Connection closed while downloading tarball file
  CXX(target) Release/obj.target/grpc/deps/grpc/src/core/lib/surface/init.o
  CXX(target) Release/obj.target/grpc/deps/grpc/src/core/lib/surface/init.o
rm: ./Release/.deps/Release/obj.target/grpc/deps/grpc/src/core/lib/surface/init.o.d.raw: No such file or directory
make: *** [Release/obj.target/grpc/deps/grpc/src/core/lib/surface/init.o] Error 1
gyp  CXX(target) Release/obj.target/grpc/deps/grpc/src/core/lib/avl/avl.o
 ERR! build error
gyp ERR! stack Error: `make` failed with exit code: 2
gyp ERR! stack     at ChildProcess.onExit (/usr/local/lib/node_modules/npm/node_modules/node-gyp/lib/build.js:262:23)
gyp ERR! stack     at ChildProcess.emit (events.js:182:13)
gyp ERR! stack     at Process.ChildProcess._handle.onexit (internal/child_process.js:240:12)
gyp ERR! System Darwin 17.7.0
gyp ERR! command "/usr/local/bin/node" "/usr/local/lib/node_modules/npm/node_modules/node-gyp/bin/node-gyp.js" "build" "--fallback-to-build" "--library=static_library" "--module=/Users/anspireagency/Desktop/ahmed f/Doctory/node_modules/grpc/src/node/extension_binary/node-v64-darwin-x64-unknown/grpc_node.node" "--module_name=grpc_node" "--module_path=/Users/anspireagency/Desktop/ahmed f/Doctory/node_modules/grpc/src/node/extension_binary/node-v64-darwin-x64-unknown"
gyp ERR! cwd /Users/anspireagency/Desktop/ahmed f/Doctory/node_modules/grpc
gyp ERR! node -v v10.13.0
gyp ERR! node-gyp -v v3.8.0
gyp ERR! not ok
node-pre-gyp ERR! build error
node-pre-gyp ERR! stack Error: Failed to execute '/usr/local/bin/node /usr/local/lib/node_modules/npm/node_modules/node-gyp/bin/node-gyp.js build --fallback-to-build --library=static_library --module=/Users/anspireagency/Desktop/ahmed f/Doctory/node_modules/grpc/src/node/extension_binary/node-v64-darwin-x64-unknown/grpc_node.node --module_name=grpc_node --module_path=/Users/anspireagency/Desktop/ahmed f/Doctory/node_modules/grpc/src/node/extension_binary/node-v64-darwin-x64-unknown' (1)
node-pre-gyp ERR! stack     at ChildProcess.<anonymous> (/Users/anspireagency/Desktop/ahmed f/Doctory/node_modules/grpc/node_modules/node-pre-gyp/lib/util/compile.js:83:29)
node-pre-gyp ERR! stack     at ChildProcess.emit (events.js:182:13)
node-pre-gyp ERR! stack     at maybeClose (internal/child_process.js:962:16)
node-pre-gyp ERR! stack     at Process.ChildProcess._handle.onexit (internal/child_process.js:251:5)
node-pre-gyp ERR! System Darwin 17.7.0
node-pre-gyp ERR! command "/usr/local/bin/node" "/Users/anspireagency/Desktop/ahmed f/Doctory/node_modules/grpc/node_modules/.bin/node-pre-gyp" "install" "--fallback-to-build" "--library=static_library"
node-pre-gyp ERR! cwd /Users/anspireagency/Desktop/ahmed f/Doctory/node_modules/grpc
node-pre-gyp ERR! node -v v10.13.0
node-pre-gyp ERR! node-pre-gyp -v v0.7.0
node-pre-gyp ERR! not ok
Failed to execute '/usr/local/bin/node /usr/local/lib/node_modules/npm/node_modules/node-gyp/bin/node-gyp.js build --fallback-to-build --library=static_library --module=/Users/anspireagency/Desktop/ahmed f/Doctory/node_modules/grpc/src/node/extension_binary/node-v64-darwin-x64-unknown/grpc_node.node --module_name=grpc_node --module_path=/Users/anspireagency/Desktop/ahmed f/Doctory/node_modules/grpc/src/node/extension_binary/node-v64-darwin-x64-unknown' (1)
  CXX(target) Release/obj.target/grpc/deps/grpc/src/core/lib/backoff/backoff.oexec install script
In file included from ../deps/grpc/src/core/lib/backoff/backoff.cc:19:iled to exec install script
In file included from ../deps/grpc/src/core/lib/backoff/backoff.h:22:
../deps/grpc/src/core/lib/iomgr/exec_ctx.h:22:10: fatal error: 'grpc/support/atm.h' file not found
#include <grpc/support/atm.h>
         ^~~~~~~~~~~~~~~~~~~~
1 error generated.░⸩ ⠸ install: info lifecycle grpc@1.10.1~install: Failed to exec install script
make: *** [Release/obj.target/grpc/deps/grpc/src/core/lib/backoff/backoff.o] Error 1
gyp ERR! build error
gyp ERR! stack Error: `make` failed with exit code: 2
gyp ERR! stack     at ChildProcess.onExit (/usr/local/lib/node_modules/npm/node_modules/node-gyp/lib/build.js:262:23)
gyp ERR! stack     at ChildProcess.emit (events.js:182:13)
gyp ERR! stack     at Process.ChildProcess._handle.onexit (internal/child_process.js:240:12)
gyp ERR! System Darwin 17.7.0
gyp ERR! command "/usr/local/bin/node" "/usr/local/lib/node_modules/npm/node_modules/node-gyp/bin/node-gyp.js" "build" "--fallback-to-build" "--library=static_library" "--module=/Users/anspireagency/Desktop/ahmed f/Doctory/node_modules/grpc/src/node/extension_binary/node-v64-darwin-x64-unknown/grpc_node.node" "--module_name=grpc_node" "--module_path=/Users/anspireagency/Desktop/ahmed f/Doctory/node_modules/grpc/src/node/extension_binary/node-v64-darwin-x64-unknown"
gyp ERR! cwd /Users/anspireagency/Desktop/ahmed f/Doctory/node_modules/grpc
gyp ERR! node -v v10.13.0
gyp ERR! node-gyp -v v3.8.0
gyp ERR! not ok
npm ERR! code ELIFECYCLE
npm ERR! errno 1
npm ERR! grpc@1.10.1 install: `node-pre-gyp install --fallback-to-build --library=static_library`
npm ERR! Exit status 1
npm ERR!
npm ERR! Failed at the grpc@1.10.1 install script.
npm ERR! This is probably not a problem with npm. There is likely additional logging output above.

npm ERR! A complete log of this run can be found in:
npm ERR!     /Users/anspireagency/.npm/_logs/2018-11-06T07_50_46_601Z-debug.log

#2

which node version do you have?
Are your dependecies at the right version?


#3

i solved it … my node version was 10 and downgraded to node version 8 worked for me