Build error Did you specify the proper '-injars' options


#1

BUILD FAILED in 6s
37 actionable tasks: 8 executed, 29 up-to-date
(node:688) UnhandledPromiseRejectionWarning: Error: cmd: Command failed with exi
t code 1 Error output:
FAILURE: Build failed with an exception.

  • What went wrong:
    Execution failed for task ‘:app:transformClassesWithMultidexlistForDebug’.

java.io.IOException: The input doesn’t contain any classes. Did you specify th
e proper ‘-injars’ options?

  • Try:
    Run with --stacktrace option to get the stack trace. Run with --info or --debug
    option to get more log output.

  • Get more help at https://help.gradle.org